{"text_format":"1","workbook":"xlsx","n_sheets":17,"sheets":["Hallo!","Anleitung","Jan","Feb","März","April","Mai","Juni","Juli","Aug","Sept","Okt","Nov","Dez","Gleitzeitsaldo","meine Daten","Feiertage"],"not_rendered":{"charts":0,"images":6,"macros":1,"external_links":0,"defined_names":16,"comments":0,"pivot_tables":0},"unopened":[],"bounds":{"document_bytes":16777216,"sheet_cells":100000,"rows_first":2000,"rows_last":500,"rows_between":2000,"halvings":0,"cell_chars":16384,"cell_head_chars":4096},"cells_cut":0,"cells_raw":0,"read":"whole","date_system":"1904"}

{"sheet":"Hallo!","index":0,"n_rows":0,"n_cols":0,"rows_kept":0,"cut":false,"hidden":false,"merged":[[3,1,3,11],[10,1,10,14],[21,7,21,11]]}

{"sheet":"Anleitung","index":1,"n_rows":27,"n_cols":8,"rows_kept":27,"cut":false,"hidden":false,"merged":[[8,1,8,14],[3,1,3,11],[24,7,25,11],[20,1,21,10],[26,6,26,11]]}
["So benutzen Sie der Arbeitszeit-Checker:"]
[]
[null,"Vorbereitung der Aufzeichnung durch den Arbeitgeber:"]
[null,"Achtung - dieses Formular arbeitet mit Makros - diese bitte aktivieren!\nTragen Sie bitte die Feiertage des jeweiligen Jahres im Blatt Feiertage ein.  \nDies sollte zentral erfolgen, bevor das Dokument an alle Beschäftigten verteilt wird. \nSchützen sie alle Blätter mit einem Kennwort (im Urzustand: azkg)"]
[]
[null,"Vorbereitung der Aufzeichnung durch die Beschäftigten:"]
[null,"Geben Sie bitte Name, Sollarbeitszeit, Gleitzeitübertrag vom Vorjahr und Urlaubstage  auf dem Blatt  \"meine Daten\" ein"]
[]
[null,"Zeit Hinweise zum Eingeben der Uhrzeiten: \nDie jeweiligen Uhrzeiten ganz einfach in der Reihenfolge Stunden:Minuten OHNE Doppelpunkt eingeben.\nDie Summenwerte sind so eingestellt, dass nur Stunden und Minuten angezeigt werden."]
[null,"z.B.","1 Std. und 20 Minuten werden angezeigt  :",null,null,null,5.5555555555555552E-2]
[null,null,"32 Std. und 40 Minuten werden angezeigt :",null,null,null,1.3611111111111109]
[null,"Sollte die tägliche Netto-Arbeitszeit 10 Stunden überschreiten, erscheint die Nettoarbeitszeit in einem roten Feld."]
[]
[]
[null,"Die Summe des Gleitzeitsaldos wird automatisch in den nächsten Monat übertragen."]
[]
[null,"Auf dem Blatt \"Gleitzeitsaldo\" finden Sie einen jeweils aktuellen Überblick."]
[]
[null,"Haftungsausschluss: Trotz sorgfältiger Erstellung sind Haftungsanspüche durch die Nutzung des Checkers ausgeschlossen."]
[]
[null,"Alle Informationen zum Arbeitszeitrecht und zu klugen Arbeitszeitmodellen \nfinden Sie auf unserer Wissensplattform \nwww.arbeitszeit-klug-gestalten.de"]
[]
[]
[null,null,null,null,null,null,null,"„Der Arbeitszeit-Checker“ von Simone Back für www.arbeitszeit-klug-gestalten.de"]
[null,"Version: 03/Dez. 2022",null,null,null,null,null,"ist lizensiert unter einer Creative Commons Lizenz CC BY SA 4.0 \n(Nutzung bei Namensnennung, Weitergabe unter gleichen Bedingungen)"]
[]
[null,null,null,null,null,null,"Copyright für das Logo \"Arbeitszeit klug gestalten\": RKW Hessen. Das Logo darf nur für den Checker in der Ursprungsform genutzt werden."]

{"sheet":"Jan","index":2,"n_rows":49,"n_cols":23,"rows_kept":49,"cut":false,"hidden":false,"merged":[[47,22,47,25],[48,21,49,25],[45,22,46,25],[3,15,3,16],[7,9,7,10],[7,11,7,12],[6,15,7,15],[9,1,9,15],[6,1,8,1],[6,2,8,2],[6,4,8,4],[6,5,8,5],[6,3,8,3]]}
[null,"Arbeitszeit-Nachweis",null,null,null,null,null,"Name:",null,{"$f":"IF('meine Daten'!C3=\"\",\"\",'meine Daten'!C3)","v":""},null,null,null,null,null,null,null,null,{"$f":"B11","v":"2023-01-01"},{"$f":"B11","v":"2023-01-01"}]
[]
[null,null,null,null,"Symbol* :  ","U","=Urlaub"]
[null,null,null,null,null,"AU","=Krank/Kur",null,null,null,null,null,null,null,"bedeutet:","Eintrag fehlt "]
[null,null,null,null,null,"Z","Zeitausgleich (ganzer Tag)",null,null,null,null,null,null,null,"bedeutet:","mehr als 10 Stunden"]
[]
[null,"Datum","Tag","Sollzeit","Feiertag","Symbol *","Brutto-Arbeitszeit",null,null,"Pausen",null,null,null,null,"Netto","weitere\nReisezeit","Saldo"]
[null,null,null,null,null,null,null,null,null,"Mittag",null,"weitere\n(Std:Min)",null,"Summe","Arbeits-\nzeit",null,"Arbeits-\nzeit"]
[null,null,null,null,null,null,"von","bis","Std:Min","von","bis","I","II","./.Std:Min","Std:Min","Std:Min","Std:Min",null,null,"Bemerkung"]
[null,"Übertrag vom Vorjahr: ",null,null,null,null,null,null,null,null,null,null,null,null,null,null,{"$f":"IF('meine Daten'!L39=\"\",-('meine Daten'!M39),'meine Daten'!L39)","v":0}]
[null,{"$f":"Feiertage!B5","v":"2023-01-01"},{"$f":"TEXT(B11,\"TTT\")","v":"So"},{"$f":"IF(OR(E11=\"F\",F11=\"U\",F11=\"AU\"),'meine Daten'!$C$12,IF(C11=\"Mo\",'meine Daten'!$C$5,IF(C11=\"Di\",'meine Daten'!$C$6,IF(C11=\"Mi\",'meine Daten'!$C$7,IF(C11=\"Do\",'meine Daten'!$C$8,IF(C11=\"Fr\",'meine Daten'!$C$9,IF(C11=\"Sa\",'meine Daten'!$C$10,IF(C11=\"So\",'meine Daten'!$C$11))))))))","v":"00:00:00"},{"$f":"IF(R11=\"Feiertag\",\"F\",\"\")","v":"F"},null,null,null,{"$f":"H11-G11","v":"00:00:00"},null,null,null,null,{"$f":"K11-J11+L11+M11","v":"00:00:00"},{"$f":"I11-N11","v":"00:00:00"},null,{"$f":"IF(F11=\"Z\",-(D11),IF(G11=\"\",\" \",IF(O11+P11>D11,O11+P11-D11,IF(O11+P11<D11,-(D11-O11-P11),\" \"))))","v":" "},{"$f":"IF(ISERROR(VLOOKUP(B11,Feiertage!$B$5:$B$21,1,FALSE)),WEEKDAY(B11,2),\"Feiertag\")","v":"Feiertag"},{"$f":"IF(J11-G11>6,1,0)","v":0}]
[null,{"$f":"B11+1","v":"2023-01-02"},{"$f":"TEXT(B12,\"TTT\")","v":"Mo"},{"$f":"IF(OR(E12=\"F\",F12=\"U\",F12=\"AU\"),'meine Daten'!$C$12,IF(C12=\"Mo\",'meine Daten'!$C$5,IF(C12=\"Di\",'meine Daten'!$C$6,IF(C12=\"Mi\",'meine Daten'!$C$7,IF(C12=\"Do\",'meine Daten'!$C$8,IF(C12=\"Fr\",'meine Daten'!$C$9,IF(C12=\"Sa\",'meine Daten'!$C$10,IF(C12=\"So\",'meine Daten'!$C$11))))))))","v":"08:00:00"},"",null,null,null,{"$f":"H12-G12","v":"00:00:00"},null,null,null,null,{"$f":"K12-J12+L12+M12","v":"00:00:00"},"00:00:00",null,{"$f":"IF(F12=\"Z\",-(D12),IF(G12=\"\",\" \",IF(O12+P12>D12,O12+P12-D12,IF(O12+P12<D12,-(D12-O12-P12),\" \"))))","v":" "},{"$f":"IF(ISERROR(VLOOKUP(B12,Feiertage!$B$5:$B$21,1,FALSE)),WEEKDAY(B12,2),\"Feiertag\")","v":1},{"$f":"H11-G12","v":0}]
[null,{"$f":"B12+1","v":"2023-01-03"},"Di",{"$f":"IF(OR(E13=\"F\",F13=\"U\",F13=\"AU\"),'meine Daten'!$C$12,IF(C13=\"Mo\",'meine Daten'!$C$5,IF(C13=\"Di\",'meine Daten'!$C$6,IF(C13=\"Mi\",'meine Daten'!$C$7,IF(C13=\"Do\",'meine Daten'!$C$8,IF(C13=\"Fr\",'meine Daten'!$C$9,IF(C13=\"Sa\",'meine Daten'!$C$10,IF(C13=\"So\",'meine Daten'!$C$11))))))))","v":"08:00:00"},"",null,null,null,{"$f":"H13-G13","v":"00:00:00"},null,null,null,null,"00:00:00","00:00:00",null,{"$f":"IF(F13=\"Z\",-(D13),IF(G13=\"\",\" \",IF(O13+P13>D13,O13+P13-D13,IF(O13+P13<D13,-(D13-O13-P13),\" \"))))","v":" "},{"$f":"IF(ISERROR(VLOOKUP(B13,Feiertage!$B$5:$B$21,1,FALSE)),WEEKDAY(B13,2),\"Feiertag\")","v":2}]
[null,"2023-01-04","Mi",{"$f":"IF(OR(E14=\"F\",F14=\"U\",F14=\"AU\"),'meine Daten'!$C$12,IF(C14=\"Mo\",'meine Daten'!$C$5,IF(C14=\"Di\",'meine Daten'!$C$6,IF(C14=\"Mi\",'meine Daten'!$C$7,IF(C14=\"Do\",'meine Daten'!$C$8,IF(C14=\"Fr\",'meine Daten'!$C$9,IF(C14=\"Sa\",'meine Daten'!$C$10,IF(C14=\"So\",'meine Daten'!$C$11))))))))","v":"08:00:00"},"",null,null,null,"00:00:00",null,null,null,null,"00:00:00","00:00:00",null," ",{"$f":"IF(ISERROR(VLOOKUP(B14,Feiertage!$B$5:$B$21,1,FALSE)),WEEKDAY(B14,2),\"Feiertag\")","v":3}]
[null,"2023-01-05","Do",{"$f":"IF(OR(E15=\"F\",F15=\"U\",F15=\"AU\"),'meine Daten'!$C$12,IF(C15=\"Mo\",'meine Daten'!$C$5,IF(C15=\"Di\",'meine Daten'!$C$6,IF(C15=\"Mi\",'meine Daten'!$C$7,IF(C15=\"Do\",'meine Daten'!$C$8,IF(C15=\"Fr\",'meine Daten'!$C$9,IF(C15=\"Sa\",'meine Daten'!$C$10,IF(C15=\"So\",'meine Daten'!$C$11))))))))","v":"08:00:00"},"",null,null,null,"00:00:00",null,null,null,null,"00:00:00","00:00:00",null," ",{"$f":"IF(ISERROR(VLOOKUP(B15,Feiertage!$B$5:$B$21,1,FALSE)),WEEKDAY(B15,2),\"Feiertag\")","v":4}]
[null,"2023-01-06","Fr",{"$f":"IF(OR(E16=\"F\",F16=\"U\",F16=\"AU\"),'meine Daten'!$C$12,IF(C16=\"Mo\",'meine Daten'!$C$5,IF(C16=\"Di\",'meine Daten'!$C$6,IF(C16=\"Mi\",'meine Daten'!$C$7,IF(C16=\"Do\",'meine Daten'!$C$8,IF(C16=\"Fr\",'meine Daten'!$C$9,IF(C16=\"Sa\",'meine Daten'!$C$10,IF(C16=\"So\",'meine Daten'!$C$11))))))))","v":"08:00:00"},"",null,null,null,"00:00:00",null,null,null,null,"00:00:00","00:00:00",null," ",{"$f":"IF(ISERROR(VLOOKUP(B16,Feiertage!$B$5:$B$21,1,FALSE)),WEEKDAY(B16,2),\"Feiertag\")","v":5}]
[null,"2023-01-07","Sa",{"$f":"IF(OR(E17=\"F\",F17=\"U\",F17=\"AU\"),'meine Daten'!$C$12,IF(C17=\"Mo\",'meine Daten'!$C$5,IF(C17=\"Di\",'meine Daten'!$C$6,IF(C17=\"Mi\",'meine Daten'!$C$7,IF(C17=\"Do\",'meine Daten'!$C$8,IF(C17=\"Fr\",'meine Daten'!$C$9,IF(C17=\"Sa\",'meine Daten'!$C$10,IF(C17=\"So\",'meine Daten'!$C$11))))))))","v":"00:00:00"},"",null,null,null,"00:00:00",null,null,null,null,"00:00:00","00:00:00",null," ",{"$f":"IF(ISERROR(VLOOKUP(B17,Feiertage!$B$5:$B$21,1,FALSE)),WEEKDAY(B17,2),\"Feiertag\")","v":6}]
[null,"2023-01-08","So",{"$f":"IF(OR(E18=\"F\",F18=\"U\",F18=\"AU\"),'meine Daten'!$C$12,IF(C18=\"Mo\",'meine Daten'!$C$5,IF(C18=\"Di\",'meine Daten'!$C$6,IF(C18=\"Mi\",'meine Daten'!$C$7,IF(C18=\"Do\",'meine Daten'!$C$8,IF(C18=\"Fr\",'meine Daten'!$C$9,IF(C18=\"Sa\",'meine Daten'!$C$10,IF(C18=\"So\",'meine Daten'!$C$11))))))))","v":"00:00:00"},"",null,null,null,"00:00:00",null,null,null,null,"00:00:00","00:00:00",null," ",{"$f":"IF(ISERROR(VLOOKUP(B18,Feiertage!$B$5:$B$21,1,FALSE)),WEEKDAY(B18,2),\"Feiertag\")","v":7}]
[null,"2023-01-09","Mo",{"$f":"IF(OR(E19=\"F\",F19=\"U\",F19=\"AU\"),'meine Daten'!$C$12,IF(C19=\"Mo\",'meine Daten'!$C$5,IF(C19=\"Di\",'meine Daten'!$C$6,IF(C19=\"Mi\",'meine Daten'!$C$7,IF(C19=\"Do\",'meine Daten'!$C$8,IF(C19=\"Fr\",'meine Daten'!$C$9,IF(C19=\"Sa\",'meine Daten'!$C$10,IF(C19=\"So\",'meine Daten'!$C$11))))))))","v":"08:00:00"},"",null,null,null,"00:00:00",null,null,null,null,"00:00:00","00:00:00",null," ",{"$f":"IF(ISERROR(VLOOKUP(B19,Feiertage!$B$5:$B$21,1,FALSE)),WEEKDAY(B19,2),\"Feiertag\")","v":1}]
[null,"2023-01-10","Di",{"$f":"IF(OR(E20=\"F\",F20=\"U\",F20=\"AU\"),'meine Daten'!$C$12,IF(C20=\"Mo\",'meine Daten'!$C$5,IF(C20=\"Di\",'meine Daten'!$C$6,IF(C20=\"Mi\",'meine Daten'!$C$7,IF(C20=\"Do\",'meine Daten'!$C$8,IF(C20=\"Fr\",'meine Daten'!$C$9,IF(C20=\"Sa\",'meine Daten'!$C$10,IF(C20=\"So\",'meine Daten'!$C$11))))))))","v":"08:00:00"},"",null,null,null,"00:00:00",null,null,null,null,"00:00:00","00:00:00",null," ",{"$f":"IF(ISERROR(VLOOKUP(B20,Feiertage!$B$5:$B$21,1,FALSE)),WEEKDAY(B20,2),\"Feiertag\")","v":2}]
[null,"2023-01-11","Mi",{"$f":"IF(OR(E21=\"F\",F21=\"U\",F21=\"AU\"),'meine Daten'!$C$12,IF(C21=\"Mo\",'meine Daten'!$C$5,IF(C21=\"Di\",'meine Daten'!$C$6,IF(C21=\"Mi\",'meine Daten'!$C$7,IF(C21=\"Do\",'meine Daten'!$C$8,IF(C21=\"Fr\",'meine Daten'!$C$9,IF(C21=\"Sa\",'meine Daten'!$C$10,IF(C21=\"So\",'meine Daten'!$C$11))))))))","v":"08:00:00"},"",null,null,null,"00:00:00",null,null,null,null,"00:00:00","00:00:00",null," ",{"$f":"IF(ISERROR(VLOOKUP(B21,Feiertage!$B$5:$B$21,1,FALSE)),WEEKDAY(B21,2),\"Feiertag\")","v":3}]
[null,"2023-01-12","Do",{"$f":"IF(OR(E22=\"F\",F22=\"U\",F22=\"AU\"),'meine Daten'!$C$12,IF(C22=\"Mo\",'meine Daten'!$C$5,IF(C22=\"Di\",'meine Daten'!$C$6,IF(C22=\"Mi\",'meine Daten'!$C$7,IF(C22=\"Do\",'meine Daten'!$C$8,IF(C22=\"Fr\",'meine Daten'!$C$9,IF(C22=\"Sa\",'meine Daten'!$C$10,IF(C22=\"So\",'meine Daten'!$C$11))))))))","v":"08:00:00"},"",null,null,null,"00:00:00",null,null,null,null,"00:00:00","00:00:00",null," ",{"$f":"IF(ISERROR(VLOOKUP(B22,Feiertage!$B$5:$B$21,1,FALSE)),WEEKDAY(B22,2),\"Feiertag\")","v":4}]
[null,"2023-01-13","Fr",{"$f":"IF(OR(E23=\"F\",F23=\"U\",F23=\"AU\"),'meine Daten'!$C$12,IF(C23=\"Mo\",'meine Daten'!$C$5,IF(C23=\"Di\",'meine Daten'!$C$6,IF(C23=\"Mi\",'meine Daten'!$C$7,IF(C23=\"Do\",'meine Daten'!$C$8,IF(C23=\"Fr\",'meine Daten'!$C$9,IF(C23=\"Sa\",'meine Daten'!$C$10,IF(C23=\"So\",'meine Daten'!$C$11))))))))","v":"08:00:00"},"",null,null,null,"00:00:00",null,null,null,null,"00:00:00","00:00:00",null," ",{"$f":"IF(ISERROR(VLOOKUP(B23,Feiertage!$B$5:$B$21,1,FALSE)),WEEKDAY(B23,2),\"Feiertag\")","v":5}]
[null,"2023-01-14","Sa",{"$f":"IF(OR(E24=\"F\",F24=\"U\",F24=\"AU\"),'meine Daten'!$C$12,IF(C24=\"Mo\",'meine Daten'!$C$5,IF(C24=\"Di\",'meine Daten'!$C$6,IF(C24=\"Mi\",'meine Daten'!$C$7,IF(C24=\"Do\",'meine Daten'!$C$8,IF(C24=\"Fr\",'meine Daten'!$C$9,IF(C24=\"Sa\",'meine Daten'!$C$10,IF(C24=\"So\",'meine Daten'!$C$11))))))))","v":"00:00:00"},"",null,null,null,"00:00:00",null,null,null,null,"00:00:00","00:00:00",null," ",{"$f":"IF(ISERROR(VLOOKUP(B24,Feiertage!$B$5:$B$21,1,FALSE)),WEEKDAY(B24,2),\"Feiertag\")","v":6}]
[null,"2023-01-15","So",{"$f":"IF(OR(E25=\"F\",F25=\"U\",F25=\"AU\"),'meine Daten'!$C$12,IF(C25=\"Mo\",'meine Daten'!$C$5,IF(C25=\"Di\",'meine Daten'!$C$6,IF(C25=\"Mi\",'meine Daten'!$C$7,IF(C25=\"Do\",'meine Daten'!$C$8,IF(C25=\"Fr\",'meine Daten'!$C$9,IF(C25=\"Sa\",'meine Daten'!$C$10,IF(C25=\"So\",'meine Daten'!$C$11))))))))","v":"00:00:00"},"",null,null,null,"00:00:00",null,null,null,null,"00:00:00","00:00:00",null," ",{"$f":"IF(ISERROR(VLOOKUP(B25,Feiertage!$B$5:$B$21,1,FALSE)),WEEKDAY(B25,2),\"Feiertag\")","v":7}]
[null,"2023-01-16","Mo",{"$f":"IF(OR(E26=\"F\",F26=\"U\",F26=\"AU\"),'meine Daten'!$C$12,IF(C26=\"Mo\",'meine Daten'!$C$5,IF(C26=\"Di\",'meine Daten'!$C$6,IF(C26=\"Mi\",'meine Daten'!$C$7,IF(C26=\"Do\",'meine Daten'!$C$8,IF(C26=\"Fr\",'meine Daten'!$C$9,IF(C26=\"Sa\",'meine Daten'!$C$10,IF(C26=\"So\",'meine Daten'!$C$11))))))))","v":"08:00:00"},"",null,null,null,"00:00:00",null,null,null,null,"00:00:00","00:00:00",null," ",{"$f":"IF(ISERROR(VLOOKUP(B26,Feiertage!$B$5:$B$21,1,FALSE)),WEEKDAY(B26,2),\"Feiertag\")","v":1}]
[null,"2023-01-17","Di",{"$f":"IF(OR(E27=\"F\",F27=\"U\",F27=\"AU\"),'meine Daten'!$C$12,IF(C27=\"Mo\",'meine Daten'!$C$5,IF(C27=\"Di\",'meine Daten'!$C$6,IF(C27=\"Mi\",'meine Daten'!$C$7,IF(C27=\"Do\",'meine Daten'!$C$8,IF(C27=\"Fr\",'meine Daten'!$C$9,IF(C27=\"Sa\",'meine Daten'!$C$10,IF(C27=\"So\",'meine Daten'!$C$11))))))))","v":"08:00:00"},"",null,null,null,"00:00:00",null,null,null,null,"00:00:00","00:00:00",null," ",{"$f":"IF(ISERROR(VLOOKUP(B27,Feiertage!$B$5:$B$21,1,FALSE)),WEEKDAY(B27,2),\"Feiertag\")","v":2}]
[null,"2023-01-18","Mi",{"$f":"IF(OR(E28=\"F\",F28=\"U\",F28=\"AU\"),'meine Daten'!$C$12,IF(C28=\"Mo\",'meine Daten'!$C$5,IF(C28=\"Di\",'meine Daten'!$C$6,IF(C28=\"Mi\",'meine Daten'!$C$7,IF(C28=\"Do\",'meine Daten'!$C$8,IF(C28=\"Fr\",'meine Daten'!$C$9,IF(C28=\"Sa\",'meine Daten'!$C$10,IF(C28=\"So\",'meine Daten'!$C$11))))))))","v":"08:00:00"},"",null,null,null,"00:00:00",null,null,null,null,"00:00:00","00:00:00",null," ",{"$f":"IF(ISERROR(VLOOKUP(B28,Feiertage!$B$5:$B$21,1,FALSE)),WEEKDAY(B28,2),\"Feiertag\")","v":3}]
[null,"2023-01-19","Do",{"$f":"IF(OR(E29=\"F\",F29=\"U\",F29=\"AU\"),'meine Daten'!$C$12,IF(C29=\"Mo\",'meine Daten'!$C$5,IF(C29=\"Di\",'meine Daten'!$C$6,IF(C29=\"Mi\",'meine Daten'!$C$7,IF(C29=\"Do\",'meine Daten'!$C$8,IF(C29=\"Fr\",'meine Daten'!$C$9,IF(C29=\"Sa\",'meine Daten'!$C$10,IF(C29=\"So\",'meine Daten'!$C$11))))))))","v":"08:00:00"},"",null,null,null,"00:00:00",null,null,null,null,"00:00:00","00:00:00",null," ",{"$f":"IF(ISERROR(VLOOKUP(B29,Feiertage!$B$5:$B$21,1,FALSE)),WEEKDAY(B29,2),\"Feiertag\")","v":4}]
[null,"2023-01-20","Fr",{"$f":"IF(OR(E30=\"F\",F30=\"U\",F30=\"AU\"),'meine Daten'!$C$12,IF(C30=\"Mo\",'meine Daten'!$C$5,IF(C30=\"Di\",'meine Daten'!$C$6,IF(C30=\"Mi\",'meine Daten'!$C$7,IF(C30=\"Do\",'meine Daten'!$C$8,IF(C30=\"Fr\",'meine Daten'!$C$9,IF(C30=\"Sa\",'meine Daten'!$C$10,IF(C30=\"So\",'meine Daten'!$C$11))))))))","v":"08:00:00"},"",null,null,null,"00:00:00",null,null,null,null,"00:00:00","00:00:00",null," ",{"$f":"IF(ISERROR(VLOOKUP(B30,Feiertage!$B$5:$B$21,1,FALSE)),WEEKDAY(B30,2),\"Feiertag\")","v":5}]
[null,"2023-01-21","Sa",{"$f":"IF(OR(E31=\"F\",F31=\"U\",F31=\"AU\"),'meine Daten'!$C$12,IF(C31=\"Mo\",'meine Daten'!$C$5,IF(C31=\"Di\",'meine Daten'!$C$6,IF(C31=\"Mi\",'meine Daten'!$C$7,IF(C31=\"Do\",'meine Daten'!$C$8,IF(C31=\"Fr\",'meine Daten'!$C$9,IF(C31=\"Sa\",'meine Daten'!$C$10,IF(C31=\"So\",'meine Daten'!$C$11))))))))","v":"00:00:00"},"",null,null,null,"00:00:00",null,null,null,null,"00:00:00","00:00:00",null," ",{"$f":"IF(ISERROR(VLOOKUP(B31,Feiertage!$B$5:$B$21,1,FALSE)),WEEKDAY(B31,2),\"Feiertag\")","v":6}]
[null,"2023-01-22","So",{"$f":"IF(OR(E32=\"F\",F32=\"U\",F32=\"AU\"),'meine Daten'!$C$12,IF(C32=\"Mo\",'meine Daten'!$C$5,IF(C32=\"Di\",'meine Daten'!$C$6,IF(C32=\"Mi\",'meine Daten'!$C$7,IF(C32=\"Do\",'meine Daten'!$C$8,IF(C32=\"Fr\",'meine Daten'!$C$9,IF(C32=\"Sa\",'meine Daten'!$C$10,IF(C32=\"So\",'meine Daten'!$C$11))))))))","v":"00:00:00"},"",null,null,null,"00:00:00",null,null,null,null,"00:00:00","00:00:00",null," ",{"$f":"IF(ISERROR(VLOOKUP(B32,Feiertage!$B$5:$B$21,1,FALSE)),WEEKDAY(B32,2),\"Feiertag\")","v":7}]
[null,"2023-01-23","Mo",{"$f":"IF(OR(E33=\"F\",F33=\"U\",F33=\"AU\"),'meine Daten'!$C$12,IF(C33=\"Mo\",'meine Daten'!$C$5,IF(C33=\"Di\",'meine Daten'!$C$6,IF(C33=\"Mi\",'meine Daten'!$C$7,IF(C33=\"Do\",'meine Daten'!$C$8,IF(C33=\"Fr\",'meine Daten'!$C$9,IF(C33=\"Sa\",'meine Daten'!$C$10,IF(C33=\"So\",'meine Daten'!$C$11))))))))","v":"08:00:00"},"",null,null,null,"00:00:00",null,null,null,null,"00:00:00","00:00:00",null," ",{"$f":"IF(ISERROR(VLOOKUP(B33,Feiertage!$B$5:$B$21,1,FALSE)),WEEKDAY(B33,2),\"Feiertag\")","v":1}]
[null,"2023-01-24","Di",{"$f":"IF(OR(E34=\"F\",F34=\"U\",F34=\"AU\"),'meine Daten'!$C$12,IF(C34=\"Mo\",'meine Daten'!$C$5,IF(C34=\"Di\",'meine Daten'!$C$6,IF(C34=\"Mi\",'meine Daten'!$C$7,IF(C34=\"Do\",'meine Daten'!$C$8,IF(C34=\"Fr\",'meine Daten'!$C$9,IF(C34=\"Sa\",'meine Daten'!$C$10,IF(C34=\"So\",'meine Daten'!$C$11))))))))","v":"08:00:00"},"",null,null,null,"00:00:00",null,null,null,null,"00:00:00","00:00:00",null," ",{"$f":"IF(ISERROR(VLOOKUP(B34,Feiertage!$B$5:$B$21,1,FALSE)),WEEKDAY(B34,2),\"Feiertag\")","v":2}]
[null,"2023-01-25","Mi",{"$f":"IF(OR(E35=\"F\",F35=\"U\",F35=\"AU\"),'meine Daten'!$C$12,IF(C35=\"Mo\",'meine Daten'!$C$5,IF(C35=\"Di\",'meine Daten'!$C$6,IF(C35=\"Mi\",'meine Daten'!$C$7,IF(C35=\"Do\",'meine Daten'!$C$8,IF(C35=\"Fr\",'meine Daten'!$C$9,IF(C35=\"Sa\",'meine Daten'!$C$10,IF(C35=\"So\",'meine Daten'!$C$11))))))))","v":"08:00:00"},"",null,null,null,"00:00:00",null,null,null,null,"00:00:00","00:00:00",null," ",{"$f":"IF(ISERROR(VLOOKUP(B35,Feiertage!$B$5:$B$21,1,FALSE)),WEEKDAY(B35,2),\"Feiertag\")","v":3}]
[null,"2023-01-26","Do",{"$f":"IF(OR(E36=\"F\",F36=\"U\",F36=\"AU\"),'meine Daten'!$C$12,IF(C36=\"Mo\",'meine Daten'!$C$5,IF(C36=\"Di\",'meine Daten'!$C$6,IF(C36=\"Mi\",'meine Daten'!$C$7,IF(C36=\"Do\",'meine Daten'!$C$8,IF(C36=\"Fr\",'meine Daten'!$C$9,IF(C36=\"Sa\",'meine Daten'!$C$10,IF(C36=\"So\",'meine Daten'!$C$11))))))))","v":"08:00:00"},"",null,null,null,"00:00:00",null,null,null,null,"00:00:00","00:00:00",null," ",{"$f":"IF(ISERROR(VLOOKUP(B36,Feiertage!$B$5:$B$21,1,FALSE)),WEEKDAY(B36,2),\"Feiertag\")","v":4}]
[null,"2023-01-27","Fr",{"$f":"IF(OR(E37=\"F\",F37=\"U\",F37=\"AU\"),'meine Daten'!$C$12,IF(C37=\"Mo\",'meine Daten'!$C$5,IF(C37=\"Di\",'meine Daten'!$C$6,IF(C37=\"Mi\",'meine Daten'!$C$7,IF(C37=\"Do\",'meine Daten'!$C$8,IF(C37=\"Fr\",'meine Daten'!$C$9,IF(C37=\"Sa\",'meine Daten'!$C$10,IF(C37=\"So\",'meine Daten'!$C$11))))))))","v":"08:00:00"},"",null,null,null,"00:00:00",null,null,null,null,"00:00:00","00:00:00",null," ",{"$f":"IF(ISERROR(VLOOKUP(B37,Feiertage!$B$5:$B$21,1,FALSE)),WEEKDAY(B37,2),\"Feiertag\")","v":5}]
[null,"2023-01-28","Sa",{"$f":"IF(OR(E38=\"F\",F38=\"U\",F38=\"AU\"),'meine Daten'!$C$12,IF(C38=\"Mo\",'meine Daten'!$C$5,IF(C38=\"Di\",'meine Daten'!$C$6,IF(C38=\"Mi\",'meine Daten'!$C$7,IF(C38=\"Do\",'meine Daten'!$C$8,IF(C38=\"Fr\",'meine Daten'!$C$9,IF(C38=\"Sa\",'meine Daten'!$C$10,IF(C38=\"So\",'meine Daten'!$C$11))))))))","v":"00:00:00"},"",null,null,null,"00:00:00",null,null,null,null,"00:00:00","00:00:00",null," ",{"$f":"IF(ISERROR(VLOOKUP(B38,Feiertage!$B$5:$B$21,1,FALSE)),WEEKDAY(B38,2),\"Feiertag\")","v":6},null,null,null,"Ich versichere die Richtigkeit meiner Angaben. Mir ist bekannt, "]
[null,"2023-01-29","So",{"$f":"IF(OR(E39=\"F\",F39=\"U\",F39=\"AU\"),'meine Daten'!$C$12,IF(C39=\"Mo\",'meine Daten'!$C$5,IF(C39=\"Di\",'meine Daten'!$C$6,IF(C39=\"Mi\",'meine Daten'!$C$7,IF(C39=\"Do\",'meine Daten'!$C$8,IF(C39=\"Fr\",'meine Daten'!$C$9,IF(C39=\"Sa\",'meine Daten'!$C$10,IF(C39=\"So\",'meine Daten'!$C$11))))))))","v":"00:00:00"},"",null,null,null,"00:00:00",null,null,null,null,"00:00:00","00:00:00",null," ",{"$f":"IF(ISERROR(VLOOKUP(B39,Feiertage!$B$5:$B$21,1,FALSE)),WEEKDAY(B39,2),\"Feiertag\")","v":7},null,null,null,"dass unrichtige Angaben eine grobe Pflichtverletzung darstellen. "]
[null,"2023-01-30","Mo",{"$f":"IF(OR(E40=\"F\",F40=\"U\",F40=\"AU\"),'meine Daten'!$C$12,IF(C40=\"Mo\",'meine Daten'!$C$5,IF(C40=\"Di\",'meine Daten'!$C$6,IF(C40=\"Mi\",'meine Daten'!$C$7,IF(C40=\"Do\",'meine Daten'!$C$8,IF(C40=\"Fr\",'meine Daten'!$C$9,IF(C40=\"Sa\",'meine Daten'!$C$10,IF(C40=\"So\",'meine Daten'!$C$11))))))))","v":"08:00:00"},"",null,null,null,"00:00:00",null,null,null,null,"00:00:00","00:00:00",null," ",{"$f":"IF(ISERROR(VLOOKUP(B40,Feiertage!$B$5:$B$21,1,FALSE)),WEEKDAY(B40,2),\"Feiertag\")","v":1}]
[null,"2023-01-31","Di",{"$f":"IF(OR(E41=\"F\",F41=\"U\",F41=\"AU\"),'meine Daten'!$C$12,IF(C41=\"Mo\",'meine Daten'!$C$5,IF(C41=\"Di\",'meine Daten'!$C$6,IF(C41=\"Mi\",'meine Daten'!$C$7,IF(C41=\"Do\",'meine Daten'!$C$8,IF(C41=\"Fr\",'meine Daten'!$C$9,IF(C41=\"Sa\",'meine Daten'!$C$10,IF(C41=\"So\",'meine Daten'!$C$11))))))))","v":"08:00:00"},null,null,null,null,"00:00:00",null,null,null,null,"00:00:00","00:00:00",null,{"$f":"IF(F41=\"Z\",-(D41),IF(G41=\"\",\" \",IF(O41+P41>D41,O41+P41-D41,IF(O41+P41<D41,-(D41-O41-P41),\" \"))))","v":" "},{"$f":"IF(ISERROR(VLOOKUP(B41,Feiertage!$B$5:$B$21,1,FALSE)),WEEKDAY(B41,2),\"Feiertag\")","v":2}]
[null,null,null,null,null,{"$f":"COUNTIF(F13:F41,\"U\")+COUNTIF(F13:F41,\"Z\")+COUNTIF(F13:F41,AU)","v":0},{"$f":"IF(SUM(G13:G41)<=0,0,1)","v":0},null,null,null,null,null,null,null,null,null,{"$f":"SUM(Q11:Q41)","v":0}]
[null,null,null,null,null,null,null,null,null,null,null,null,null,"Monatssaldo:",null,null,{"$f":"IF(F42+G42=0,\"\",SUM(Q11:Q41))","v":""}]
[null,null,null,null,null,null,null,null,null,null,null,null,null,"Gleitzeitkontostand:",null,null,{"$f":"IF(F42+G42=0,\"\",(Q10+Q43))","v":""},null,null,null,null,"Datum, Unterschrift"]
[null,null,null,null,null,null,null,null,null,null,null,null,null,"(In Stunden:Minuten)"]
[null,null,null,null,null,null,null,null,null,null,null,null,null,null,null,null,null,null,null,null,null,null,"„Der Arbeitszeit-Checker“ von Simone Back für www.arbeitszeit-klug-gestalten.de "]
[null,null,null,null,null,null,null,null,null,null,null,null,null,"Urlaubstage",null,null,{"$f":"COUNTIF(F11:F41,\"U\")","v":0}]
[null,null,null,null,null,null,null,null,null,null,null,null,null,null,null,null,null,null,null,null,null,null,"ist lizensiert unter einer Creative Commons Lizenz CC BY SA 4.0 \n(Nutzung bei Namensnennung, Weitergabe unter gleichen Bedingungen)"]
[null,null,null,null,null,null,null,null,null,null,null,null,null,null,null,null,null,null,null,null,null,"Copyright für das Logo \"Arbeitszeit klug gestalten\": RKW Hessen. Das Logo darf nur für den Checker in der Ursprungsform genutzt werden."]

{"sheet":"Feb","index":3,"n_rows":49,"n_cols":23,"rows_kept":49,"cut":false,"hidden":false,"merged":[[47,22,47,25],[48,21,49,25],[45,22,46,25],[9,1,9,15],[45,1,45,2],[3,15,3,16],[6,1,8,1],[6,2,8,2],[6,3,8,3],[6,4,8,4],[6,5,8,5],[6,15,7,15],[7,9,7,10],[7,11,7,12]]}
[null,"Arbeitszeit-Nachweis",null,null,null,null,null,"Name:",null,{"$f":"IF('meine Daten'!C3=\"\",\"\",'meine Daten'!C3)","v":""},null,null,null,null,null,null,null,null,{"$f":"B11","v":"2023-02-01"},{"$f":"B11","v":"2023-02-01"}]
[]
[null,null,null,null,"Symbol* :  ","U","=Urlaub"]
[null,null,null,null,null,"AU","=Krank/Kur",null,null,null,null,null,null,null,"bedeutet:","Eintrag fehlt "]
[null,null,null,null,null,"Z","Zeitausgleich (ganzer Tag)",null,null,null,null,null,null,null,"bedeutet:","mehr als 10 Stunden"]
[]
[null,"Datum","Tag","Sollzeit","Feiertag","Symbol *","Brutto-Arbeitszeit",null,null,"Pausen",null,null,null,null,"Netto","weitere\nReisezeit","Saldo"]
[null,null,null,null,null,null,null,null,null,"Mittag",null,"weitere\n(Std:Min)",null,"Summe","Arbeits-\nzeit",null,"Arbeits-\nzeit"]
[null,null,null,null,null,null,"von","bis","Std:Min","von","bis","I","II","./.Std:Min","Std:Min","Std:Min","Std:Min",null,null,"Bemerkung"]
[null,"Übertrag vom Vormonat: ",null,null,null,null,null,null,null,null,null,null,null,null,null,null,{"$f":"Jan!Q44","v":""}]
[null,{"$f":"Jan!B11+31","v":"2023-02-01"},{"$f":"TEXT(B11,\"TTT\")","v":"Mi"},{"$f":"IF(OR(E11=\"F\",F11=\"U\",F11=\"AU\"),'meine Daten'!$C$12,IF(C11=\"Mo\",'meine Daten'!$C$13,IF(C11=\"Di\",'meine Daten'!$C$14,IF(C11=\"Mi\",'meine Daten'!$C$15,IF(C11=\"Do\",'meine Daten'!$C$16,IF(C11=\"Fr\",'meine Daten'!$C$17,IF(C11=\"Sa\",'meine Daten'!$C$18,IF(C11=\"So\",'meine Daten'!$C$19))))))))","v":"08:00:00"},{"$f":"IF(R11=\"Feiertag\",\"F\",\"\")","v":""},null,null,null,{"$f":"H11-G11","v":"00:00:00"},null,null,null,null,{"$f":"K11-J11+L11+M11","v":"00:00:00"},{"$f":"I11-N11","v":"00:00:00"},null,{"$f":"IF(F11=\"Z\",-(D11),IF(G11=\"\",\" \",IF(O11+P11>D11,O11+P11-D11,IF(O11+P11<D11,-(D11-O11-P11),\" \"))))","v":" "},{"$f":"IF(ISERROR(VLOOKUP(B11,Feiertage!$B$5:$B$21,1,FALSE)),WEEKDAY(B11,2),\"Feiertag\")","v":3},{"$f":"IF(G11=\"\",0,(O11+P11-D11)*24)","v":0}]
[null,{"$f":"B11+1","v":"2023-02-02"},{"$f":"TEXT(B12,\"TTT\")","v":"Do"},{"$f":"IF(OR(E12=\"F\",F12=\"U\",F12=\"AU\"),'meine Daten'!$C$12,IF(C12=\"Mo\",'meine Daten'!$C$13,IF(C12=\"Di\",'meine Daten'!$C$14,IF(C12=\"Mi\",'meine Daten'!$C$15,IF(C12=\"Do\",'meine Daten'!$C$16,IF(C12=\"Fr\",'meine Daten'!$C$17,IF(C12=\"Sa\",'meine Daten'!$C$18,IF(C12=\"So\",'meine Daten'!$C$19))))))))","v":"08:00:00"},"",null,null,null,{"$f":"H12-G12","v":"00:00:00"},null,null,null,null,{"$f":"K12-J12+L12+M12","v":"00:00:00"},"00:00:00",null,{"$f":"IF(F12=\"Z\",-(D12),IF(G12=\"\",\" \",IF(O12+P12>D12,O12+P12-D12,IF(O12+P12<D12,-(D12-O12-P12),\" \"))))","v":" "},{"$f":"IF(ISERROR(VLOOKUP(B12,Feiertage!$B$5:$B$21,1,FALSE)),WEEKDAY(B12,2),\"Feiertag\")","v":4},{"$f":"S11+IF(F12=\"Z\",-(#REF!*24),IF(G12=\"\",0,(O12+P12-D12)*24))","v":0}]
[null,{"$f":"B12+1","v":"2023-02-03"},"Fr",{"$f":"IF(OR(E13=\"F\",F13=\"U\",F13=\"AU\"),'meine Daten'!$C$12,IF(C13=\"Mo\",'meine Daten'!$C$13,IF(C13=\"Di\",'meine Daten'!$C$14,IF(C13=\"Mi\",'meine Daten'!$C$15,IF(C13=\"Do\",'meine Daten'!$C$16,IF(C13=\"Fr\",'meine Daten'!$C$17,IF(C13=\"Sa\",'meine Daten'!$C$18,IF(C13=\"So\",'meine Daten'!$C$19))))))))","v":"08:00:00"},"",null,null,null,{"$f":"H13-G13","v":"00:00:00"},null,null,null,null,"00:00:00","00:00:00",null," ",{"$f":"IF(ISERROR(VLOOKUP(B13,Feiertage!$B$5:$B$21,1,FALSE)),WEEKDAY(B13,2),\"Feiertag\")","v":5},{"$f":"S12+IF(F13=\"Z\",-(#REF!*24),IF(G13=\"\",0,(O13+P13-D13)*24))","v":0}]
[null,"2023-02-04","Sa",{"$f":"IF(OR(E14=\"F\",F14=\"U\",F14=\"AU\"),'meine Daten'!$C$12,IF(C14=\"Mo\",'meine Daten'!$C$13,IF(C14=\"Di\",'meine Daten'!$C$14,IF(C14=\"Mi\",'meine Daten'!$C$15,IF(C14=\"Do\",'meine Daten'!$C$16,IF(C14=\"Fr\",'meine Daten'!$C$17,IF(C14=\"Sa\",'meine Daten'!$C$18,IF(C14=\"So\",'meine Daten'!$C$19))))))))","v":"00:00:00"},"",null,null,null,"00:00:00",null,null,null,null,"00:00:00","00:00:00",null," ",{"$f":"IF(ISERROR(VLOOKUP(B14,Feiertage!$B$5:$B$21,1,FALSE)),WEEKDAY(B14,2),\"Feiertag\")","v":6},{"$f":"S13+IF(F14=\"Z\",-(#REF!*24),IF(G14=\"\",0,(O14+P14-D14)*24))","v":0}]
[null,"2023-02-05","So",{"$f":"IF(OR(E15=\"F\",F15=\"U\",F15=\"AU\"),'meine Daten'!$C$12,IF(C15=\"Mo\",'meine Daten'!$C$13,IF(C15=\"Di\",'meine Daten'!$C$14,IF(C15=\"Mi\",'meine Daten'!$C$15,IF(C15=\"Do\",'meine Daten'!$C$16,IF(C15=\"Fr\",'meine Daten'!$C$17,IF(C15=\"Sa\",'meine Daten'!$C$18,IF(C15=\"So\",'meine Daten'!$C$19))))))))","v":"00:00:00"},"",null,null,null,"00:00:00",null,null,null,null,"00:00:00","00:00:00",null," ",{"$f":"IF(ISERROR(VLOOKUP(B15,Feiertage!$B$5:$B$21,1,FALSE)),WEEKDAY(B15,2),\"Feiertag\")","v":7},{"$f":"S14+IF(F15=\"Z\",-(#REF!*24),IF(G15=\"\",0,(O15+P15-D15)*24))","v":0}]
[null,"2023-02-06","Mo",{"$f":"IF(OR(E16=\"F\",F16=\"U\",F16=\"AU\"),'meine Daten'!$C$12,IF(C16=\"Mo\",'meine Daten'!$C$13,IF(C16=\"Di\",'meine Daten'!$C$14,IF(C16=\"Mi\",'meine Daten'!$C$15,IF(C16=\"Do\",'meine Daten'!$C$16,IF(C16=\"Fr\",'meine Daten'!$C$17,IF(C16=\"Sa\",'meine Daten'!$C$18,IF(C16=\"So\",'meine Daten'!$C$19))))))))","v":"08:00:00"},"",null,null,null,"00:00:00",null,null,null,null,"00:00:00","00:00:00",null," ",{"$f":"IF(ISERROR(VLOOKUP(B16,Feiertage!$B$5:$B$21,1,FALSE)),WEEKDAY(B16,2),\"Feiertag\")","v":1},{"$f":"S15+IF(F16=\"Z\",-(#REF!*24),IF(G16=\"\",0,(O16+P16-D16)*24))","v":0}]
[null,"2023-02-07","Di",{"$f":"IF(OR(E17=\"F\",F17=\"U\",F17=\"AU\"),'meine Daten'!$C$12,IF(C17=\"Mo\",'meine Daten'!$C$13,IF(C17=\"Di\",'meine Daten'!$C$14,IF(C17=\"Mi\",'meine Daten'!$C$15,IF(C17=\"Do\",'meine Daten'!$C$16,IF(C17=\"Fr\",'meine Daten'!$C$17,IF(C17=\"Sa\",'meine Daten'!$C$18,IF(C17=\"So\",'meine Daten'!$C$19))))))))","v":"08:00:00"},"",null,null,null,"00:00:00",null,null,null,null,"00:00:00","00:00:00",null," ",{"$f":"IF(ISERROR(VLOOKUP(B17,Feiertage!$B$5:$B$21,1,FALSE)),WEEKDAY(B17,2),\"Feiertag\")","v":2},{"$f":"S16+IF(F17=\"Z\",-(#REF!*24),IF(G17=\"\",0,(O17+P17-D17)*24))","v":0}]
[null,"2023-02-08","Mi",{"$f":"IF(OR(E18=\"F\",F18=\"U\",F18=\"AU\"),'meine Daten'!$C$12,IF(C18=\"Mo\",'meine Daten'!$C$13,IF(C18=\"Di\",'meine Daten'!$C$14,IF(C18=\"Mi\",'meine Daten'!$C$15,IF(C18=\"Do\",'meine Daten'!$C$16,IF(C18=\"Fr\",'meine Daten'!$C$17,IF(C18=\"Sa\",'meine Daten'!$C$18,IF(C18=\"So\",'meine Daten'!$C$19))))))))","v":"08:00:00"},"",null,null,null,"00:00:00",null,null,null,null,"00:00:00","00:00:00",null," ",{"$f":"IF(ISERROR(VLOOKUP(B18,Feiertage!$B$5:$B$21,1,FALSE)),WEEKDAY(B18,2),\"Feiertag\")","v":3},{"$f":"S17+IF(F18=\"Z\",-(#REF!*24),IF(G18=\"\",0,(O18+P18-D18)*24))","v":0}]
[null,"2023-02-09","Do",{"$f":"IF(OR(E19=\"F\",F19=\"U\",F19=\"AU\"),'meine Daten'!$C$12,IF(C19=\"Mo\",'meine Daten'!$C$13,IF(C19=\"Di\",'meine Daten'!$C$14,IF(C19=\"Mi\",'meine Daten'!$C$15,IF(C19=\"Do\",'meine Daten'!$C$16,IF(C19=\"Fr\",'meine Daten'!$C$17,IF(C19=\"Sa\",'meine Daten'!$C$18,IF(C19=\"So\",'meine Daten'!$C$19))))))))","v":"08:00:00"},"",null,null,null,"00:00:00",null,null,null,null,"00:00:00","00:00:00",null," ",{"$f":"IF(ISERROR(VLOOKUP(B19,Feiertage!$B$5:$B$21,1,FALSE)),WEEKDAY(B19,2),\"Feiertag\")","v":4},{"$f":"S18+IF(F19=\"Z\",-(#REF!*24),IF(G19=\"\",0,(O19+P19-D19)*24))","v":0}]
[null,"2023-02-10","Fr",{"$f":"IF(OR(E20=\"F\",F20=\"U\",F20=\"AU\"),'meine Daten'!$C$12,IF(C20=\"Mo\",'meine Daten'!$C$13,IF(C20=\"Di\",'meine Daten'!$C$14,IF(C20=\"Mi\",'meine Daten'!$C$15,IF(C20=\"Do\",'meine Daten'!$C$16,IF(C20=\"Fr\",'meine Daten'!$C$17,IF(C20=\"Sa\",'meine Daten'!$C$18,IF(C20=\"So\",'meine Daten'!$C$19))))))))","v":"08:00:00"},"",null,null,null,"00:00:00",null,null,null,null,"00:00:00","00:00:00",null," ",{"$f":"IF(ISERROR(VLOOKUP(B20,Feiertage!$B$5:$B$21,1,FALSE)),WEEKDAY(B20,2),\"Feiertag\")","v":5},{"$f":"S19+IF(F20=\"Z\",-(#REF!*24),IF(G20=\"\",0,(O20+P20-D20)*24))","v":0}]
[null,"2023-02-11","Sa",{"$f":"IF(OR(E21=\"F\",F21=\"U\",F21=\"AU\"),'meine Daten'!$C$12,IF(C21=\"Mo\",'meine Daten'!$C$13,IF(C21=\"Di\",'meine Daten'!$C$14,IF(C21=\"Mi\",'meine Daten'!$C$15,IF(C21=\"Do\",'meine Daten'!$C$16,IF(C21=\"Fr\",'meine Daten'!$C$17,IF(C21=\"Sa\",'meine Daten'!$C$18,IF(C21=\"So\",'meine Daten'!$C$19))))))))","v":"00:00:00"},"",null,null,null,"00:00:00",null,null,null,null,"00:00:00","00:00:00",null," ",{"$f":"IF(ISERROR(VLOOKUP(B21,Feiertage!$B$5:$B$21,1,FALSE)),WEEKDAY(B21,2),\"Feiertag\")","v":6},{"$f":"S20+IF(F21=\"Z\",-(#REF!*24),IF(G21=\"\",0,(O21+P21-D21)*24))","v":0}]
[null,"2023-02-12","So",{"$f":"IF(OR(E22=\"F\",F22=\"U\",F22=\"AU\"),'meine Daten'!$C$12,IF(C22=\"Mo\",'meine Daten'!$C$13,IF(C22=\"Di\",'meine Daten'!$C$14,IF(C22=\"Mi\",'meine Daten'!$C$15,IF(C22=\"Do\",'meine Daten'!$C$16,IF(C22=\"Fr\",'meine Daten'!$C$17,IF(C22=\"Sa\",'meine Daten'!$C$18,IF(C22=\"So\",'meine Daten'!$C$19))))))))","v":"00:00:00"},"",null,null,null,"00:00:00",null,null,null,null,"00:00:00","00:00:00",null," ",{"$f":"IF(ISERROR(VLOOKUP(B22,Feiertage!$B$5:$B$21,1,FALSE)),WEEKDAY(B22,2),\"Feiertag\")","v":7},{"$f":"S21+IF(F22=\"Z\",-(#REF!*24),IF(G22=\"\",0,(O22+P22-D22)*24))","v":0}]
[null,"2023-02-13","Mo",{"$f":"IF(OR(E23=\"F\",F23=\"U\",F23=\"AU\"),'meine Daten'!$C$12,IF(C23=\"Mo\",'meine Daten'!$C$13,IF(C23=\"Di\",'meine Daten'!$C$14,IF(C23=\"Mi\",'meine Daten'!$C$15,IF(C23=\"Do\",'meine Daten'!$C$16,IF(C23=\"Fr\",'meine Daten'!$C$17,IF(C23=\"Sa\",'meine Daten'!$C$18,IF(C23=\"So\",'meine Daten'!$C$19))))))))","v":"08:00:00"},"",null,null,null,"00:00:00",null,null,null,null,"00:00:00","00:00:00",null," ",{"$f":"IF(ISERROR(VLOOKUP(B23,Feiertage!$B$5:$B$21,1,FALSE)),WEEKDAY(B23,2),\"Feiertag\")","v":1},{"$f":"S22+IF(F23=\"Z\",-(#REF!*24),IF(G23=\"\",0,(O23+P23-D23)*24))","v":0}]
[null,"2023-02-14","Di",{"$f":"IF(OR(E24=\"F\",F24=\"U\",F24=\"AU\"),'meine Daten'!$C$12,IF(C24=\"Mo\",'meine Daten'!$C$13,IF(C24=\"Di\",'meine Daten'!$C$14,IF(C24=\"Mi\",'meine Daten'!$C$15,IF(C24=\"Do\",'meine Daten'!$C$16,IF(C24=\"Fr\",'meine Daten'!$C$17,IF(C24=\"Sa\",'meine Daten'!$C$18,IF(C24=\"So\",'meine Daten'!$C$19))))))))","v":"08:00:00"},"",null,null,null,"00:00:00",null,null,null,null,"00:00:00","00:00:00",null," ",{"$f":"IF(ISERROR(VLOOKUP(B24,Feiertage!$B$5:$B$21,1,FALSE)),WEEKDAY(B24,2),\"Feiertag\")","v":2},{"$f":"S23+IF(F24=\"Z\",-(#REF!*24),IF(G24=\"\",0,(O24+P24-D24)*24))","v":0}]
[null,"2023-02-15","Mi",{"$f":"IF(OR(E25=\"F\",F25=\"U\",F25=\"AU\"),'meine Daten'!$C$12,IF(C25=\"Mo\",'meine Daten'!$C$13,IF(C25=\"Di\",'meine Daten'!$C$14,IF(C25=\"Mi\",'meine Daten'!$C$15,IF(C25=\"Do\",'meine Daten'!$C$16,IF(C25=\"Fr\",'meine Daten'!$C$17,IF(C25=\"Sa\",'meine Daten'!$C$18,IF(C25=\"So\",'meine Daten'!$C$19))))))))","v":"08:00:00"},"",null,null,null,"00:00:00",null,null,null,null,"00:00:00","00:00:00",null," ",{"$f":"IF(ISERROR(VLOOKUP(B25,Feiertage!$B$5:$B$21,1,FALSE)),WEEKDAY(B25,2),\"Feiertag\")","v":3},{"$f":"S24+IF(F25=\"Z\",-(#REF!*24),IF(G25=\"\",0,(O25+P25-D25)*24))","v":0}]
[null,"2023-02-16","Do",{"$f":"IF(OR(E26=\"F\",F26=\"U\",F26=\"AU\"),'meine Daten'!$C$12,IF(C26=\"Mo\",'meine Daten'!$C$13,IF(C26=\"Di\",'meine Daten'!$C$14,IF(C26=\"Mi\",'meine Daten'!$C$15,IF(C26=\"Do\",'meine Daten'!$C$16,IF(C26=\"Fr\",'meine Daten'!$C$17,IF(C26=\"Sa\",'meine Daten'!$C$18,IF(C26=\"So\",'meine Daten'!$C$19))))))))","v":"08:00:00"},"",null,null,null,"00:00:00",null,null,null,null,"00:00:00","00:00:00",null," ",{"$f":"IF(ISERROR(VLOOKUP(B26,Feiertage!$B$5:$B$21,1,FALSE)),WEEKDAY(B26,2),\"Feiertag\")","v":4},{"$f":"S25+IF(F26=\"Z\",-(#REF!*24),IF(G26=\"\",0,(O26+P26-D26)*24))","v":0}]
[null,"2023-02-17","Fr",{"$f":"IF(OR(E27=\"F\",F27=\"U\",F27=\"AU\"),'meine Daten'!$C$12,IF(C27=\"Mo\",'meine Daten'!$C$13,IF(C27=\"Di\",'meine Daten'!$C$14,IF(C27=\"Mi\",'meine Daten'!$C$15,IF(C27=\"Do\",'meine Daten'!$C$16,IF(C27=\"Fr\",'meine Daten'!$C$17,IF(C27=\"Sa\",'meine Daten'!$C$18,IF(C27=\"So\",'meine Daten'!$C$19))))))))","v":"08:00:00"},"",null,null,null,"00:00:00",null,null,null,null,"00:00:00","00:00:00",null," ",{"$f":"IF(ISERROR(VLOOKUP(B27,Feiertage!$B$5:$B$21,1,FALSE)),WEEKDAY(B27,2),\"Feiertag\")","v":5},{"$f":"S26+IF(F27=\"Z\",-(#REF!*24),IF(G27=\"\",0,(O27+P27-D27)*24))","v":0}]
[null,"2023-02-18","Sa",{"$f":"IF(OR(E28=\"F\",F28=\"U\",F28=\"AU\"),'meine Daten'!$C$12,IF(C28=\"Mo\",'meine Daten'!$C$13,IF(C28=\"Di\",'meine Daten'!$C$14,IF(C28=\"Mi\",'meine Daten'!$C$15,IF(C28=\"Do\",'meine Daten'!$C$16,IF(C28=\"Fr\",'meine Daten'!$C$17,IF(C28=\"Sa\",'meine Daten'!$C$18,IF(C28=\"So\",'meine Daten'!$C$19))))))))","v":"00:00:00"},"",null,null,null,"00:00:00",null,null,null,null,"00:00:00","00:00:00",null," ",{"$f":"IF(ISERROR(VLOOKUP(B28,Feiertage!$B$5:$B$21,1,FALSE)),WEEKDAY(B28,2),\"Feiertag\")","v":6},{"$f":"S27+IF(F28=\"Z\",-(#REF!*24),IF(G28=\"\",0,(O28+P28-D28)*24))","v":0}]
[null,"2023-02-19","So",{"$f":"IF(OR(E29=\"F\",F29=\"U\",F29=\"AU\"),'meine Daten'!$C$12,IF(C29=\"Mo\",'meine Daten'!$C$13,IF(C29=\"Di\",'meine Daten'!$C$14,IF(C29=\"Mi\",'meine Daten'!$C$15,IF(C29=\"Do\",'meine Daten'!$C$16,IF(C29=\"Fr\",'meine Daten'!$C$17,IF(C29=\"Sa\",'meine Daten'!$C$18,IF(C29=\"So\",'meine Daten'!$C$19))))))))","v":"00:00:00"},"",null,null,null,"00:00:00",null,null,null,null,"00:00:00","00:00:00",null," ",{"$f":"IF(ISERROR(VLOOKUP(B29,Feiertage!$B$5:$B$21,1,FALSE)),WEEKDAY(B29,2),\"Feiertag\")","v":7},{"$f":"S28+IF(F29=\"Z\",-(#REF!*24),IF(G29=\"\",0,(O29+P29-D29)*24))","v":0}]
[null,"2023-02-20","Mo",{"$f":"IF(OR(E30=\"F\",F30=\"U\",F30=\"AU\"),'meine Daten'!$C$12,IF(C30=\"Mo\",'meine Daten'!$C$13,IF(C30=\"Di\",'meine Daten'!$C$14,IF(C30=\"Mi\",'meine Daten'!$C$15,IF(C30=\"Do\",'meine Daten'!$C$16,IF(C30=\"Fr\",'meine Daten'!$C$17,IF(C30=\"Sa\",'meine Daten'!$C$18,IF(C30=\"So\",'meine Daten'!$C$19))))))))","v":"08:00:00"},"",null,null,null,"00:00:00",null,null,null,null,"00:00:00","00:00:00",null," ",{"$f":"IF(ISERROR(VLOOKUP(B30,Feiertage!$B$5:$B$21,1,FALSE)),WEEKDAY(B30,2),\"Feiertag\")","v":1},{"$f":"S29+IF(F30=\"Z\",-(#REF!*24),IF(G30=\"\",0,(O30+P30-D30)*24))","v":0}]
[null,"2023-02-21","Di",{"$f":"IF(OR(E31=\"F\",F31=\"U\",F31=\"AU\"),'meine Daten'!$C$12,IF(C31=\"Mo\",'meine Daten'!$C$13,IF(C31=\"Di\",'meine Daten'!$C$14,IF(C31=\"Mi\",'meine Daten'!$C$15,IF(C31=\"Do\",'meine Daten'!$C$16,IF(C31=\"Fr\",'meine Daten'!$C$17,IF(C31=\"Sa\",'meine Daten'!$C$18,IF(C31=\"So\",'meine Daten'!$C$19))))))))","v":"08:00:00"},"",null,null,null,"00:00:00",null,null,null,null,"00:00:00","00:00:00",null," ",{"$f":"IF(ISERROR(VLOOKUP(B31,Feiertage!$B$5:$B$21,1,FALSE)),WEEKDAY(B31,2),\"Feiertag\")","v":2},{"$f":"S30+IF(F31=\"Z\",-(#REF!*24),IF(G31=\"\",0,(O31+P31-D31)*24))","v":0}]
[null,"2023-02-22","Mi",{"$f":"IF(OR(E32=\"F\",F32=\"U\",F32=\"AU\"),'meine Daten'!$C$12,IF(C32=\"Mo\",'meine Daten'!$C$13,IF(C32=\"Di\",'meine Daten'!$C$14,IF(C32=\"Mi\",'meine Daten'!$C$15,IF(C32=\"Do\",'meine Daten'!$C$16,IF(C32=\"Fr\",'meine Daten'!$C$17,IF(C32=\"Sa\",'meine Daten'!$C$18,IF(C32=\"So\",'meine Daten'!$C$19))))))))","v":"08:00:00"},"",null,null,null,"00:00:00",null,null,null,null,"00:00:00","00:00:00",null," ",{"$f":"IF(ISERROR(VLOOKUP(B32,Feiertage!$B$5:$B$21,1,FALSE)),WEEKDAY(B32,2),\"Feiertag\")","v":3},{"$f":"S31+IF(F32=\"Z\",-(#REF!*24),IF(G32=\"\",0,(O32+P32-D32)*24))","v":0}]
[null,"2023-02-23","Do",{"$f":"IF(OR(E33=\"F\",F33=\"U\",F33=\"AU\"),'meine Daten'!$C$12,IF(C33=\"Mo\",'meine Daten'!$C$13,IF(C33=\"Di\",'meine Daten'!$C$14,IF(C33=\"Mi\",'meine Daten'!$C$15,IF(C33=\"Do\",'meine Daten'!$C$16,IF(C33=\"Fr\",'meine Daten'!$C$17,IF(C33=\"Sa\",'meine Daten'!$C$18,IF(C33=\"So\",'meine Daten'!$C$19))))))))","v":"08:00:00"},"",null,null,null,"00:00:00",null,null,null,null,"00:00:00","00:00:00",null," ",{"$f":"IF(ISERROR(VLOOKUP(B33,Feiertage!$B$5:$B$21,1,FALSE)),WEEKDAY(B33,2),\"Feiertag\")","v":4},{"$f":"S32+IF(F33=\"Z\",-(#REF!*24),IF(G33=\"\",0,(O33+P33-D33)*24))","v":0}]
[null,"2023-02-24","Fr",{"$f":"IF(OR(E34=\"F\",F34=\"U\",F34=\"AU\"),'meine Daten'!$C$12,IF(C34=\"Mo\",'meine Daten'!$C$13,IF(C34=\"Di\",'meine Daten'!$C$14,IF(C34=\"Mi\",'meine Daten'!$C$15,IF(C34=\"Do\",'meine Daten'!$C$16,IF(C34=\"Fr\",'meine Daten'!$C$17,IF(C34=\"Sa\",'meine Daten'!$C$18,IF(C34=\"So\",'meine Daten'!$C$19))))))))","v":"08:00:00"},"",null,null,null,"00:00:00",null,null,null,null,"00:00:00","00:00:00",null," ",{"$f":"IF(ISERROR(VLOOKUP(B34,Feiertage!$B$5:$B$21,1,FALSE)),WEEKDAY(B34,2),\"Feiertag\")","v":5},{"$f":"S33+IF(F34=\"Z\",-(#REF!*24),IF(G34=\"\",0,(O34+P34-D34)*24))","v":0}]
[null,"2023-02-25","Sa",{"$f":"IF(OR(E35=\"F\",F35=\"U\",F35=\"AU\"),'meine Daten'!$C$12,IF(C35=\"Mo\",'meine Daten'!$C$13,IF(C35=\"Di\",'meine Daten'!$C$14,IF(C35=\"Mi\",'meine Daten'!$C$15,IF(C35=\"Do\",'meine Daten'!$C$16,IF(C35=\"Fr\",'meine Daten'!$C$17,IF(C35=\"Sa\",'meine Daten'!$C$18,IF(C35=\"So\",'meine Daten'!$C$19))))))))","v":"00:00:00"},"",null,null,null,"00:00:00",null,null,null,null,"00:00:00","00:00:00",null," ",{"$f":"IF(ISERROR(VLOOKUP(B35,Feiertage!$B$5:$B$21,1,FALSE)),WEEKDAY(B35,2),\"Feiertag\")","v":6},{"$f":"S34+IF(F35=\"Z\",-(#REF!*24),IF(G35=\"\",0,(O35+P35-D35)*24))","v":0}]
[null,"2023-02-26","So",{"$f":"IF(OR(E36=\"F\",F36=\"U\",F36=\"AU\"),'meine Daten'!$C$12,IF(C36=\"Mo\",'meine Daten'!$C$13,IF(C36=\"Di\",'meine Daten'!$C$14,IF(C36=\"Mi\",'meine Daten'!$C$15,IF(C36=\"Do\",'meine Daten'!$C$16,IF(C36=\"Fr\",'meine Daten'!$C$17,IF(C36=\"Sa\",'meine Daten'!$C$18,IF(C36=\"So\",'meine Daten'!$C$19))))))))","v":"00:00:00"},"",null,null,null,"00:00:00",null,null,null,null,"00:00:00","00:00:00",null," ",{"$f":"IF(ISERROR(VLOOKUP(B36,Feiertage!$B$5:$B$21,1,FALSE)),WEEKDAY(B36,2),\"Feiertag\")","v":7},{"$f":"S35+IF(F36=\"Z\",-(#REF!*24),IF(G36=\"\",0,(O36+P36-D36)*24))","v":0}]
[null,"2023-02-27","Mo",{"$f":"IF(OR(E37=\"F\",F37=\"U\",F37=\"AU\"),'meine Daten'!$C$12,IF(C37=\"Mo\",'meine Daten'!$C$13,IF(C37=\"Di\",'meine Daten'!$C$14,IF(C37=\"Mi\",'meine Daten'!$C$15,IF(C37=\"Do\",'meine Daten'!$C$16,IF(C37=\"Fr\",'meine Daten'!$C$17,IF(C37=\"Sa\",'meine Daten'!$C$18,IF(C37=\"So\",'meine Daten'!$C$19))))))))","v":"08:00:00"},"",null,null,null,"00:00:00",null,null,null,null,"00:00:00","00:00:00",null," ",{"$f":"IF(ISERROR(VLOOKUP(B37,Feiertage!$B$5:$B$21,1,FALSE)),WEEKDAY(B37,2),\"Feiertag\")","v":1},{"$f":"S36+IF(F37=\"Z\",-(#REF!*24),IF(G37=\"\",0,(O37+P37-D37)*24))","v":0}]
[null,{"$f":"B37+1","v":"2023-02-28"},{"$f":"TEXT(B38,\"TTT\")","v":"Di"},{"$f":"IF(OR(E38=\"F\",F38=\"U\",F38=\"AU\"),'meine Daten'!$C$12,IF(C38=\"Mo\",'meine Daten'!$C$13,IF(C38=\"Di\",'meine Daten'!$C$14,IF(C38=\"Mi\",'meine Daten'!$C$15,IF(C38=\"Do\",'meine Daten'!$C$16,IF(C38=\"Fr\",'meine Daten'!$C$17,IF(C38=\"Sa\",'meine Daten'!$C$18,IF(C38=\"So\",'meine Daten'!$C$19))))))))","v":"08:00:00"},{"$f":"IF(R38=\"Feiertag\",\"F\",\"\")","v":""},null,null,null,{"$f":"H38-G38","v":"00:00:00"},null,null,null,null,{"$f":"K38-J38+L38+M38","v":"00:00:00"},{"$f":"I38-N38","v":"00:00:00"},null," ",{"$f":"IF(ISERROR(VLOOKUP(B38,Feiertage!$B$5:$B$21,1,FALSE)),WEEKDAY(B38,2),\"Feiertag\")","v":2},{"$f":"S37+IF(F38=\"Z\",-(#REF!*24),IF(G38=\"\",0,(O38+P38-D38)*24))","v":0},null,null,"Ich versichere die Richtigkeit meiner Angaben. Mir ist bekannt, "]
[{"$f":"IF(B39=\"\",28,29)","v":28},{"$f":"IF(AND(DAY(DATE(YEAR(Feiertage!B5),3,0))=29,YEAR(Feiertage!B5)<>1900),B38+1,\"\")","v":""},{"$f":"TEXT(B39,\"TTT\")","v":""},{"$f":"IF(C39=\"\",\"\",IF(OR(E36=\"F\",F36=\"U\",F36=\"AU\"),'meine Daten'!$C$12,IF(C36=\"Mo\",'meine Daten'!$C$13,IF(C36=\"Di\",'meine Daten'!$C$14,IF(C36=\"Mi\",'meine Daten'!$C$15,IF(C36=\"Do\",'meine Daten'!$C$16,IF(C36=\"Fr\",'meine Daten'!$C$17,IF(C36=\"Sa\",'meine Daten'!$C$18,IF(C36=\"So\",'meine Daten'!$C$19)))))))))","v":""},{"$f":"IF(R39=\"Feiertag\",\"F\",\"\")","v":""},null,null,null,{"$f":"H39-G39","v":"00:00:00"},null,null,null,null,{"$f":"K39-J39+L39+M39","v":"00:00:00"},{"$f":"I39-N39","v":"00:00:00"},null," ",{"$f":"IF(B39=\"\",\"\",IF(ISERROR(VLOOKUP(B39,Feiertage!$B$5:$C$21,1,FALSE)),WEEKDAY(B39,2),\"Feiertag\"))","v":""},{"$f":"S38+IF(F39=\"Z\",-(#REF!*24),IF(G39=\"\",0,(O39+P39-D39)*24))","v":0},null,null,"dass unrichtige Angaben eine grobe Pflichtverletzung darstellen. "]
[null,null,null,null,null,{"$f":"COUNTIF(F11:F39,\"U\")+COUNTIF(F11:F39,\"Z\")+COUNTIF(F11:F39,AU)","v":0},{"$f":"IF(SUM(G11:G39)<=0,0,1)","v":0},null,null,null,null,null,null,null,null,null,{"$f":"SUM(Q11:Q39)","v":0}]
[null,null,null,null,null,null,null,null,null,null,null,null,null,"Monatssaldo:",null,null,{"$f":"IF(F40+G40=0,\"\",SUM(Q11:Q39))","v":""}]
[null,null,null,null,null,null,null,null,null,null,null,null,null,"Gleitzeitkontostand:",null,null,{"$f":"IF(OR(Q10=\"\",Q41=\"\"),\"\",Q10+Q41)","v":""}]
[null,null,null,null,null,null,null,null,null,null,null,null,null,"(In Stunden:Minuten)"]
[null,null,null,null,null,null,null,null,null,null,null,null,null,null,null,null,null,null,null,null,null,"Datum, Unterschrift"]
[null,null,null,null,null,null,null,null,null,null,null,null,null,"Urlaubstage",null,null,{"$f":"COUNTIF(F11:F39,\"U\")","v":0}]
[null,null,null,null,null,null,null,null,null,null,null,null,null,null,null,null,null,null,null,null,null,null,"„Der Arbeitszeit-Checker“ von Simone Back für www.arbeitszeit-klug-gestalten.de "]
[]
[null,null,null,null,null,null,null,null,null,null,null,null,null,null,null,null,null,null,null,null,null,null,"ist lizensiert unter einer Creative Commons Lizenz CC BY SA 4.0 \n(Nutzung bei Namensnennung, Weitergabe unter gleichen Bedingungen)"]
[null,null,null,null,null,null,null,null,null,null,null,null,null,null,null,null,null,null,null,null,null,"Copyright für das Logo \"Arbeitszeit klug gestalten\": RKW Hessen. Das Logo darf nur für den Checker in der Ursprungsform genutzt werden."]

{"sheet":"März","index":4,"n_rows":49,"n_cols":23,"rows_kept":49,"cut":false,"hidden":false,"merged":[[48,21,49,25],[45,22,46,25],[9,1,9,15],[47,1,47,2],[3,15,3,16],[6,1,8,1],[6,2,8,2],[6,3,8,3],[6,4,8,4],[6,5,8,5],[6,15,7,15],[7,9,7,10],[7,11,7,12],[47,22,47,25]]}
[null,"Arbeitszeit-Nachweis",null,null,null,null,null,"Name:",null,{"$f":"IF('meine Daten'!C3=\"\",\"\",'meine Daten'!C3)","v":""},null,null,null,null,null,null,null,null,{"$f":"B11","v":"2023-03-01"},{"$f":"B11","v":"2023-03-01"}]
[]
[null,null,null,null,"Symbol* :  ","U","=Urlaub"]
[null,null,null,null,null,"AU","=Krank/Kur",null,null,null,null,null,null,null,"bedeutet:","Eintrag fehlt "]
[null,null,null,null,null,"Z","Zeitausgleich (ganzer Tag)",null,null,null,null,null,null,null,"bedeutet:","mehr als 10 Stunden"]
[]
[null,"Datum","Tag","Sollzeit","Feiertag","Symbol *","Brutto-Arbeitszeit",null,null,"Pausen",null,null,null,null,"Netto","weitere\nReisezeit","Saldo"]
[null,null,null,null,null,null,null,null,null,"Mittag",null,"weitere\n(Std:Min)",null,"Summe","Arbeits-\nzeit",null,"Arbeits-\nzeit"]
[null,null,null,null,null,null,"von","bis","Std:Min","von","bis","I","II","./.Std:Min","Std:Min","Std:Min","Std:Min",null,null,"Bemerkung"]
[null,"Übertrag vom Vormonat: ",null,null,null,null,null,null,null,null,null,null,null,null,null,null,{"$f":"Feb!Q42","v":""}]
[null,{"$f":"Feb!B11+Feb!A39","v":"2023-03-01"},{"$f":"TEXT(B11,\"TTT\")","v":"Mi"},{"$f":"IF(OR(E11=\"F\",F11=\"U\",F11=\"AU\"),'meine Daten'!$C$12,IF(C11=\"Mo\",'meine Daten'!$C$21,IF(C11=\"Di\",'meine Daten'!$C$22,IF(C11=\"Mi\",'meine Daten'!$C$23,IF(C11=\"Do\",'meine Daten'!$C$24,IF(C11=\"Fr\",'meine Daten'!$C$25,IF(C11=\"Sa\",'meine Daten'!$C$26,IF(C11=\"So\",'meine Daten'!$C$27))))))))","v":"08:00:00"},{"$f":"IF(R11=\"Feiertag\",\"F\",\"\")","v":""},null,null,null,{"$f":"H11-G11","v":"00:00:00"},null,null,null,null,{"$f":"K11-J11+L11+M11","v":"00:00:00"},{"$f":"I11-N11","v":"00:00:00"},null,{"$f":"IF(F11=\"Z\",-(D11),IF(G11=\"\",\" \",IF(O11+P11>D11,O11+P11-D11,IF(O11+P11<D11,-(D11-O11-P11),\" \"))))","v":" "},{"$f":"IF(ISERROR(VLOOKUP(B11,Feiertage!$B$5:$B$21,1,FALSE)),WEEKDAY(B11,2),\"Feiertag\")","v":3},{"$f":"IF(G11=\"\",0,(O11+P11-D11)*24)","v":0}]
[null,{"$f":"B11+1","v":"2023-03-02"},{"$f":"TEXT(B12,\"TTT\")","v":"Do"},{"$f":"IF(OR(E12=\"F\",F12=\"U\",F12=\"AU\"),'meine Daten'!$C$12,IF(C12=\"Mo\",'meine Daten'!$C$21,IF(C12=\"Di\",'meine Daten'!$C$22,IF(C12=\"Mi\",'meine Daten'!$C$23,IF(C12=\"Do\",'meine Daten'!$C$24,IF(C12=\"Fr\",'meine Daten'!$C$25,IF(C12=\"Sa\",'meine Daten'!$C$26,IF(C12=\"So\",'meine Daten'!$C$27))))))))","v":"08:00:00"},"",null,null,null,{"$f":"H12-G12","v":"00:00:00"},null,null,null,null,{"$f":"K12-J12+L12+M12","v":"00:00:00"},"00:00:00",null,{"$f":"IF(F12=\"Z\",-(D12),IF(G12=\"\",\" \",IF(O12+P12>D12,O12+P12-D12,IF(O12+P12<D12,-(D12-O12-P12),\" \"))))","v":" "},{"$f":"IF(ISERROR(VLOOKUP(B12,Feiertage!$B$5:$B$21,1,FALSE)),WEEKDAY(B12,2),\"Feiertag\")","v":4},{"$f":"S11+IF(F12=\"Z\",-(#REF!*24),IF(G12=\"\",0,(O12+P12-D12)*24))","v":0}]
[null,{"$f":"B12+1","v":"2023-03-03"},"Fr",{"$f":"IF(OR(E13=\"F\",F13=\"U\",F13=\"AU\"),'meine Daten'!$C$12,IF(C13=\"Mo\",'meine Daten'!$C$21,IF(C13=\"Di\",'meine Daten'!$C$22,IF(C13=\"Mi\",'meine Daten'!$C$23,IF(C13=\"Do\",'meine Daten'!$C$24,IF(C13=\"Fr\",'meine Daten'!$C$25,IF(C13=\"Sa\",'meine Daten'!$C$26,IF(C13=\"So\",'meine Daten'!$C$27))))))))","v":"08:00:00"},"",null,null,null,{"$f":"H13-G13","v":"00:00:00"},null,null,null,null,"00:00:00","00:00:00",null," ",{"$f":"IF(ISERROR(VLOOKUP(B13,Feiertage!$B$5:$B$21,1,FALSE)),WEEKDAY(B13,2),\"Feiertag\")","v":5},{"$f":"S12+IF(F13=\"Z\",-(#REF!*24),IF(G13=\"\",0,(O13+P13-D13)*24))","v":0}]
[null,"2023-03-04","Sa",{"$f":"IF(OR(E14=\"F\",F14=\"U\",F14=\"AU\"),'meine Daten'!$C$12,IF(C14=\"Mo\",'meine Daten'!$C$21,IF(C14=\"Di\",'meine Daten'!$C$22,IF(C14=\"Mi\",'meine Daten'!$C$23,IF(C14=\"Do\",'meine Daten'!$C$24,IF(C14=\"Fr\",'meine Daten'!$C$25,IF(C14=\"Sa\",'meine Daten'!$C$26,IF(C14=\"So\",'meine Daten'!$C$27))))))))","v":"00:00:00"},"",null,null,null,"00:00:00",null,null,null,null,"00:00:00","00:00:00",null," ",{"$f":"IF(ISERROR(VLOOKUP(B14,Feiertage!$B$5:$B$21,1,FALSE)),WEEKDAY(B14,2),\"Feiertag\")","v":6},{"$f":"S13+IF(F14=\"Z\",-(#REF!*24),IF(G14=\"\",0,(O14+P14-D14)*24))","v":0}]
[null,"2023-03-05","So",{"$f":"IF(OR(E15=\"F\",F15=\"U\",F15=\"AU\"),'meine Daten'!$C$12,IF(C15=\"Mo\",'meine Daten'!$C$21,IF(C15=\"Di\",'meine Daten'!$C$22,IF(C15=\"Mi\",'meine Daten'!$C$23,IF(C15=\"Do\",'meine Daten'!$C$24,IF(C15=\"Fr\",'meine Daten'!$C$25,IF(C15=\"Sa\",'meine Daten'!$C$26,IF(C15=\"So\",'meine Daten'!$C$27))))))))","v":"00:00:00"},"",null,null,null,"00:00:00",null,null,null,null,"00:00:00","00:00:00",null," ",{"$f":"IF(ISERROR(VLOOKUP(B15,Feiertage!$B$5:$B$21,1,FALSE)),WEEKDAY(B15,2),\"Feiertag\")","v":7},{"$f":"S14+IF(F15=\"Z\",-(#REF!*24),IF(G15=\"\",0,(O15+P15-D15)*24))","v":0}]
[null,"2023-03-06","Mo",{"$f":"IF(OR(E16=\"F\",F16=\"U\",F16=\"AU\"),'meine Daten'!$C$12,IF(C16=\"Mo\",'meine Daten'!$C$21,IF(C16=\"Di\",'meine Daten'!$C$22,IF(C16=\"Mi\",'meine Daten'!$C$23,IF(C16=\"Do\",'meine Daten'!$C$24,IF(C16=\"Fr\",'meine Daten'!$C$25,IF(C16=\"Sa\",'meine Daten'!$C$26,IF(C16=\"So\",'meine Daten'!$C$27))))))))","v":"08:00:00"},"",null,null,null,"00:00:00",null,null,null,null,"00:00:00","00:00:00",null," ",{"$f":"IF(ISERROR(VLOOKUP(B16,Feiertage!$B$5:$B$21,1,FALSE)),WEEKDAY(B16,2),\"Feiertag\")","v":1},{"$f":"S15+IF(F16=\"Z\",-(#REF!*24),IF(G16=\"\",0,(O16+P16-D16)*24))","v":0}]
[null,"2023-03-07","Di",{"$f":"IF(OR(E17=\"F\",F17=\"U\",F17=\"AU\"),'meine Daten'!$C$12,IF(C17=\"Mo\",'meine Daten'!$C$21,IF(C17=\"Di\",'meine Daten'!$C$22,IF(C17=\"Mi\",'meine Daten'!$C$23,IF(C17=\"Do\",'meine Daten'!$C$24,IF(C17=\"Fr\",'meine Daten'!$C$25,IF(C17=\"Sa\",'meine Daten'!$C$26,IF(C17=\"So\",'meine Daten'!$C$27))))))))","v":"08:00:00"},"",null,null,null,"00:00:00",null,null,null,null,"00:00:00","00:00:00",null," ",{"$f":"IF(ISERROR(VLOOKUP(B17,Feiertage!$B$5:$B$21,1,FALSE)),WEEKDAY(B17,2),\"Feiertag\")","v":2},{"$f":"S16+IF(F17=\"Z\",-(#REF!*24),IF(G17=\"\",0,(O17+P17-D17)*24))","v":0}]
[null,"2023-03-08","Mi",{"$f":"IF(OR(E18=\"F\",F18=\"U\",F18=\"AU\"),'meine Daten'!$C$12,IF(C18=\"Mo\",'meine Daten'!$C$21,IF(C18=\"Di\",'meine Daten'!$C$22,IF(C18=\"Mi\",'meine Daten'!$C$23,IF(C18=\"Do\",'meine Daten'!$C$24,IF(C18=\"Fr\",'meine Daten'!$C$25,IF(C18=\"Sa\",'meine Daten'!$C$26,IF(C18=\"So\",'meine Daten'!$C$27))))))))","v":"08:00:00"},"",null,null,null,"00:00:00",null,null,null,null,"00:00:00","00:00:00",null," ",{"$f":"IF(ISERROR(VLOOKUP(B18,Feiertage!$B$5:$B$21,1,FALSE)),WEEKDAY(B18,2),\"Feiertag\")","v":3},{"$f":"S17+IF(F18=\"Z\",-(#REF!*24),IF(G18=\"\",0,(O18+P18-D18)*24))","v":0}]
[null,"2023-03-09","Do",{"$f":"IF(OR(E19=\"F\",F19=\"U\",F19=\"AU\"),'meine Daten'!$C$12,IF(C19=\"Mo\",'meine Daten'!$C$21,IF(C19=\"Di\",'meine Daten'!$C$22,IF(C19=\"Mi\",'meine Daten'!$C$23,IF(C19=\"Do\",'meine Daten'!$C$24,IF(C19=\"Fr\",'meine Daten'!$C$25,IF(C19=\"Sa\",'meine Daten'!$C$26,IF(C19=\"So\",'meine Daten'!$C$27))))))))","v":"08:00:00"},"",null,null,null,"00:00:00",null,null,null,null,"00:00:00","00:00:00",null," ",{"$f":"IF(ISERROR(VLOOKUP(B19,Feiertage!$B$5:$B$21,1,FALSE)),WEEKDAY(B19,2),\"Feiertag\")","v":4},{"$f":"S18+IF(F19=\"Z\",-(#REF!*24),IF(G19=\"\",0,(O19+P19-D19)*24))","v":0}]
[null,"2023-03-10","Fr",{"$f":"IF(OR(E20=\"F\",F20=\"U\",F20=\"AU\"),'meine Daten'!$C$12,IF(C20=\"Mo\",'meine Daten'!$C$21,IF(C20=\"Di\",'meine Daten'!$C$22,IF(C20=\"Mi\",'meine Daten'!$C$23,IF(C20=\"Do\",'meine Daten'!$C$24,IF(C20=\"Fr\",'meine Daten'!$C$25,IF(C20=\"Sa\",'meine Daten'!$C$26,IF(C20=\"So\",'meine Daten'!$C$27))))))))","v":"08:00:00"},"",null,null,null,"00:00:00",null,null,null,null,"00:00:00","00:00:00",null," ",{"$f":"IF(ISERROR(VLOOKUP(B20,Feiertage!$B$5:$B$21,1,FALSE)),WEEKDAY(B20,2),\"Feiertag\")","v":5},{"$f":"S19+IF(F20=\"Z\",-(#REF!*24),IF(G20=\"\",0,(O20+P20-D20)*24))","v":0}]
[null,"2023-03-11","Sa",{"$f":"IF(OR(E21=\"F\",F21=\"U\",F21=\"AU\"),'meine Daten'!$C$12,IF(C21=\"Mo\",'meine Daten'!$C$21,IF(C21=\"Di\",'meine Daten'!$C$22,IF(C21=\"Mi\",'meine Daten'!$C$23,IF(C21=\"Do\",'meine Daten'!$C$24,IF(C21=\"Fr\",'meine Daten'!$C$25,IF(C21=\"Sa\",'meine Daten'!$C$26,IF(C21=\"So\",'meine Daten'!$C$27))))))))","v":"00:00:00"},"",null,null,null,"00:00:00",null,null,null,null,"00:00:00","00:00:00",null," ",{"$f":"IF(ISERROR(VLOOKUP(B21,Feiertage!$B$5:$B$21,1,FALSE)),WEEKDAY(B21,2),\"Feiertag\")","v":6},{"$f":"S20+IF(F21=\"Z\",-(#REF!*24),IF(G21=\"\",0,(O21+P21-D21)*24))","v":0}]
[null,"2023-03-12","So",{"$f":"IF(OR(E22=\"F\",F22=\"U\",F22=\"AU\"),'meine Daten'!$C$12,IF(C22=\"Mo\",'meine Daten'!$C$21,IF(C22=\"Di\",'meine Daten'!$C$22,IF(C22=\"Mi\",'meine Daten'!$C$23,IF(C22=\"Do\",'meine Daten'!$C$24,IF(C22=\"Fr\",'meine Daten'!$C$25,IF(C22=\"Sa\",'meine Daten'!$C$26,IF(C22=\"So\",'meine Daten'!$C$27))))))))","v":"00:00:00"},"",null,null,null,"00:00:00",null,null,null,null,"00:00:00","00:00:00",null," ",{"$f":"IF(ISERROR(VLOOKUP(B22,Feiertage!$B$5:$B$21,1,FALSE)),WEEKDAY(B22,2),\"Feiertag\")","v":7},{"$f":"S21+IF(F22=\"Z\",-(#REF!*24),IF(G22=\"\",0,(O22+P22-D22)*24))","v":0}]
[null,"2023-03-13","Mo",{"$f":"IF(OR(E23=\"F\",F23=\"U\",F23=\"AU\"),'meine Daten'!$C$12,IF(C23=\"Mo\",'meine Daten'!$C$21,IF(C23=\"Di\",'meine Daten'!$C$22,IF(C23=\"Mi\",'meine Daten'!$C$23,IF(C23=\"Do\",'meine Daten'!$C$24,IF(C23=\"Fr\",'meine Daten'!$C$25,IF(C23=\"Sa\",'meine Daten'!$C$26,IF(C23=\"So\",'meine Daten'!$C$27))))))))","v":"08:00:00"},"",null,null,null,"00:00:00",null,null,null,null,"00:00:00","00:00:00",null," ",{"$f":"IF(ISERROR(VLOOKUP(B23,Feiertage!$B$5:$B$21,1,FALSE)),WEEKDAY(B23,2),\"Feiertag\")","v":1},{"$f":"S22+IF(F23=\"Z\",-(#REF!*24),IF(G23=\"\",0,(O23+P23-D23)*24))","v":0}]
[null,"2023-03-14","Di",{"$f":"IF(OR(E24=\"F\",F24=\"U\",F24=\"AU\"),'meine Daten'!$C$12,IF(C24=\"Mo\",'meine Daten'!$C$21,IF(C24=\"Di\",'meine Daten'!$C$22,IF(C24=\"Mi\",'meine Daten'!$C$23,IF(C24=\"Do\",'meine Daten'!$C$24,IF(C24=\"Fr\",'meine Daten'!$C$25,IF(C24=\"Sa\",'meine Daten'!$C$26,IF(C24=\"So\",'meine Daten'!$C$27))))))))","v":"08:00:00"},"",null,null,null,"00:00:00",null,null,null,null,"00:00:00","00:00:00",null," ",{"$f":"IF(ISERROR(VLOOKUP(B24,Feiertage!$B$5:$B$21,1,FALSE)),WEEKDAY(B24,2),\"Feiertag\")","v":2},{"$f":"S23+IF(F24=\"Z\",-(#REF!*24),IF(G24=\"\",0,(O24+P24-D24)*24))","v":0}]
[null,"2023-03-15","Mi",{"$f":"IF(OR(E25=\"F\",F25=\"U\",F25=\"AU\"),'meine Daten'!$C$12,IF(C25=\"Mo\",'meine Daten'!$C$21,IF(C25=\"Di\",'meine Daten'!$C$22,IF(C25=\"Mi\",'meine Daten'!$C$23,IF(C25=\"Do\",'meine Daten'!$C$24,IF(C25=\"Fr\",'meine Daten'!$C$25,IF(C25=\"Sa\",'meine Daten'!$C$26,IF(C25=\"So\",'meine Daten'!$C$27))))))))","v":"08:00:00"},"",null,null,null,"00:00:00",null,null,null,null,"00:00:00","00:00:00",null," ",{"$f":"IF(ISERROR(VLOOKUP(B25,Feiertage!$B$5:$B$21,1,FALSE)),WEEKDAY(B25,2),\"Feiertag\")","v":3},{"$f":"S24+IF(F25=\"Z\",-(#REF!*24),IF(G25=\"\",0,(O25+P25-D25)*24))","v":0}]
[null,"2023-03-16","Do",{"$f":"IF(OR(E26=\"F\",F26=\"U\",F26=\"AU\"),'meine Daten'!$C$12,IF(C26=\"Mo\",'meine Daten'!$C$21,IF(C26=\"Di\",'meine Daten'!$C$22,IF(C26=\"Mi\",'meine Daten'!$C$23,IF(C26=\"Do\",'meine Daten'!$C$24,IF(C26=\"Fr\",'meine Daten'!$C$25,IF(C26=\"Sa\",'meine Daten'!$C$26,IF(C26=\"So\",'meine Daten'!$C$27))))))))","v":"08:00:00"},"",null,null,null,"00:00:00",null,null,null,null,"00:00:00","00:00:00",null," ",{"$f":"IF(ISERROR(VLOOKUP(B26,Feiertage!$B$5:$B$21,1,FALSE)),WEEKDAY(B26,2),\"Feiertag\")","v":4},{"$f":"S25+IF(F26=\"Z\",-(#REF!*24),IF(G26=\"\",0,(O26+P26-D26)*24))","v":0}]
[null,"2023-03-17","Fr",{"$f":"IF(OR(E27=\"F\",F27=\"U\",F27=\"AU\"),'meine Daten'!$C$12,IF(C27=\"Mo\",'meine Daten'!$C$21,IF(C27=\"Di\",'meine Daten'!$C$22,IF(C27=\"Mi\",'meine Daten'!$C$23,IF(C27=\"Do\",'meine Daten'!$C$24,IF(C27=\"Fr\",'meine Daten'!$C$25,IF(C27=\"Sa\",'meine Daten'!$C$26,IF(C27=\"So\",'meine Daten'!$C$27))))))))","v":"08:00:00"},"",null,null,null,"00:00:00",null,null,null,null,"00:00:00","00:00:00",null," ",{"$f":"IF(ISERROR(VLOOKUP(B27,Feiertage!$B$5:$B$21,1,FALSE)),WEEKDAY(B27,2),\"Feiertag\")","v":5},{"$f":"S26+IF(F27=\"Z\",-(#REF!*24),IF(G27=\"\",0,(O27+P27-D27)*24))","v":0}]
[null,"2023-03-18","Sa",{"$f":"IF(OR(E28=\"F\",F28=\"U\",F28=\"AU\"),'meine Daten'!$C$12,IF(C28=\"Mo\",'meine Daten'!$C$21,IF(C28=\"Di\",'meine Daten'!$C$22,IF(C28=\"Mi\",'meine Daten'!$C$23,IF(C28=\"Do\",'meine Daten'!$C$24,IF(C28=\"Fr\",'meine Daten'!$C$25,IF(C28=\"Sa\",'meine Daten'!$C$26,IF(C28=\"So\",'meine Daten'!$C$27))))))))","v":"00:00:00"},"",null,null,null,"00:00:00",null,null,null,null,"00:00:00","00:00:00",null," ",{"$f":"IF(ISERROR(VLOOKUP(B28,Feiertage!$B$5:$B$21,1,FALSE)),WEEKDAY(B28,2),\"Feiertag\")","v":6},{"$f":"S27+IF(F28=\"Z\",-(#REF!*24),IF(G28=\"\",0,(O28+P28-D28)*24))","v":0}]
[null,"2023-03-19","So",{"$f":"IF(OR(E29=\"F\",F29=\"U\",F29=\"AU\"),'meine Daten'!$C$12,IF(C29=\"Mo\",'meine Daten'!$C$21,IF(C29=\"Di\",'meine Daten'!$C$22,IF(C29=\"Mi\",'meine Daten'!$C$23,IF(C29=\"Do\",'meine Daten'!$C$24,IF(C29=\"Fr\",'meine Daten'!$C$25,IF(C29=\"Sa\",'meine Daten'!$C$26,IF(C29=\"So\",'meine Daten'!$C$27))))))))","v":"00:00:00"},"",null,null,null,"00:00:00",null,null,null,null,"00:00:00","00:00:00",null," ",{"$f":"IF(ISERROR(VLOOKUP(B29,Feiertage!$B$5:$B$21,1,FALSE)),WEEKDAY(B29,2),\"Feiertag\")","v":7},{"$f":"S28+IF(F29=\"Z\",-(#REF!*24),IF(G29=\"\",0,(O29+P29-D29)*24))","v":0}]
[null,"2023-03-20","Mo",{"$f":"IF(OR(E30=\"F\",F30=\"U\",F30=\"AU\"),'meine Daten'!$C$12,IF(C30=\"Mo\",'meine Daten'!$C$21,IF(C30=\"Di\",'meine Daten'!$C$22,IF(C30=\"Mi\",'meine Daten'!$C$23,IF(C30=\"Do\",'meine Daten'!$C$24,IF(C30=\"Fr\",'meine Daten'!$C$25,IF(C30=\"Sa\",'meine Daten'!$C$26,IF(C30=\"So\",'meine Daten'!$C$27))))))))","v":"08:00:00"},"",null,null,null,"00:00:00",null,null,null,null,"00:00:00","00:00:00",null," ",{"$f":"IF(ISERROR(VLOOKUP(B30,Feiertage!$B$5:$B$21,1,FALSE)),WEEKDAY(B30,2),\"Feiertag\")","v":1},{"$f":"S29+IF(F30=\"Z\",-(#REF!*24),IF(G30=\"\",0,(O30+P30-D30)*24))","v":0}]
[null,"2023-03-21","Di",{"$f":"IF(OR(E31=\"F\",F31=\"U\",F31=\"AU\"),'meine Daten'!$C$12,IF(C31=\"Mo\",'meine Daten'!$C$21,IF(C31=\"Di\",'meine Daten'!$C$22,IF(C31=\"Mi\",'meine Daten'!$C$23,IF(C31=\"Do\",'meine Daten'!$C$24,IF(C31=\"Fr\",'meine Daten'!$C$25,IF(C31=\"Sa\",'meine Daten'!$C$26,IF(C31=\"So\",'meine Daten'!$C$27))))))))","v":"08:00:00"},"",null,null,null,"00:00:00",null,null,null,null,"00:00:00","00:00:00",null," ",{"$f":"IF(ISERROR(VLOOKUP(B31,Feiertage!$B$5:$B$21,1,FALSE)),WEEKDAY(B31,2),\"Feiertag\")","v":2},{"$f":"S30+IF(F31=\"Z\",-(#REF!*24),IF(G31=\"\",0,(O31+P31-D31)*24))","v":0}]
[null,"2023-03-22","Mi",{"$f":"IF(OR(E32=\"F\",F32=\"U\",F32=\"AU\"),'meine Daten'!$C$12,IF(C32=\"Mo\",'meine Daten'!$C$21,IF(C32=\"Di\",'meine Daten'!$C$22,IF(C32=\"Mi\",'meine Daten'!$C$23,IF(C32=\"Do\",'meine Daten'!$C$24,IF(C32=\"Fr\",'meine Daten'!$C$25,IF(C32=\"Sa\",'meine Daten'!$C$26,IF(C32=\"So\",'meine Daten'!$C$27))))))))","v":"08:00:00"},"",null,null,null,"00:00:00",null,null,null,null,"00:00:00","00:00:00",null," ",{"$f":"IF(ISERROR(VLOOKUP(B32,Feiertage!$B$5:$B$21,1,FALSE)),WEEKDAY(B32,2),\"Feiertag\")","v":3},{"$f":"S31+IF(F32=\"Z\",-(#REF!*24),IF(G32=\"\",0,(O32+P32-D32)*24))","v":0}]
[null,"2023-03-23","Do",{"$f":"IF(OR(E33=\"F\",F33=\"U\",F33=\"AU\"),'meine Daten'!$C$12,IF(C33=\"Mo\",'meine Daten'!$C$21,IF(C33=\"Di\",'meine Daten'!$C$22,IF(C33=\"Mi\",'meine Daten'!$C$23,IF(C33=\"Do\",'meine Daten'!$C$24,IF(C33=\"Fr\",'meine Daten'!$C$25,IF(C33=\"Sa\",'meine Daten'!$C$26,IF(C33=\"So\",'meine Daten'!$C$27))))))))","v":"08:00:00"},"",null,null,null,"00:00:00",null,null,null,null,"00:00:00","00:00:00",null," ",{"$f":"IF(ISERROR(VLOOKUP(B33,Feiertage!$B$5:$B$21,1,FALSE)),WEEKDAY(B33,2),\"Feiertag\")","v":4},{"$f":"S32+IF(F33=\"Z\",-(#REF!*24),IF(G33=\"\",0,(O33+P33-D33)*24))","v":0}]
[null,"2023-03-24","Fr",{"$f":"IF(OR(E34=\"F\",F34=\"U\",F34=\"AU\"),'meine Daten'!$C$12,IF(C34=\"Mo\",'meine Daten'!$C$21,IF(C34=\"Di\",'meine Daten'!$C$22,IF(C34=\"Mi\",'meine Daten'!$C$23,IF(C34=\"Do\",'meine Daten'!$C$24,IF(C34=\"Fr\",'meine Daten'!$C$25,IF(C34=\"Sa\",'meine Daten'!$C$26,IF(C34=\"So\",'meine Daten'!$C$27))))))))","v":"08:00:00"},"",null,null,null,"00:00:00",null,null,null,null,"00:00:00","00:00:00",null," ",{"$f":"IF(ISERROR(VLOOKUP(B34,Feiertage!$B$5:$B$21,1,FALSE)),WEEKDAY(B34,2),\"Feiertag\")","v":5},{"$f":"S33+IF(F34=\"Z\",-(#REF!*24),IF(G34=\"\",0,(O34+P34-D34)*24))","v":0}]
[null,"2023-03-25","Sa",{"$f":"IF(OR(E35=\"F\",F35=\"U\",F35=\"AU\"),'meine Daten'!$C$12,IF(C35=\"Mo\",'meine Daten'!$C$21,IF(C35=\"Di\",'meine Daten'!$C$22,IF(C35=\"Mi\",'meine Daten'!$C$23,IF(C35=\"Do\",'meine Daten'!$C$24,IF(C35=\"Fr\",'meine Daten'!$C$25,IF(C35=\"Sa\",'meine Daten'!$C$26,IF(C35=\"So\",'meine Daten'!$C$27))))))))","v":"00:00:00"},"",null,null,null,"00:00:00",null,null,null,null,"00:00:00","00:00:00",null," ",{"$f":"IF(ISERROR(VLOOKUP(B35,Feiertage!$B$5:$B$21,1,FALSE)),WEEKDAY(B35,2),\"Feiertag\")","v":6},{"$f":"S34+IF(F35=\"Z\",-(#REF!*24),IF(G35=\"\",0,(O35+P35-D35)*24))","v":0}]
[null,"2023-03-26","So",{"$f":"IF(OR(E36=\"F\",F36=\"U\",F36=\"AU\"),'meine Daten'!$C$12,IF(C36=\"Mo\",'meine Daten'!$C$21,IF(C36=\"Di\",'meine Daten'!$C$22,IF(C36=\"Mi\",'meine Daten'!$C$23,IF(C36=\"Do\",'meine Daten'!$C$24,IF(C36=\"Fr\",'meine Daten'!$C$25,IF(C36=\"Sa\",'meine Daten'!$C$26,IF(C36=\"So\",'meine Daten'!$C$27))))))))","v":"00:00:00"},"",null,null,null,"00:00:00",null,null,null,null,"00:00:00","00:00:00",null," ",{"$f":"IF(ISERROR(VLOOKUP(B36,Feiertage!$B$5:$B$21,1,FALSE)),WEEKDAY(B36,2),\"Feiertag\")","v":7},{"$f":"S35+IF(F36=\"Z\",-(#REF!*24),IF(G36=\"\",0,(O36+P36-D36)*24))","v":0}]
[null,"2023-03-27","Mo",{"$f":"IF(OR(E37=\"F\",F37=\"U\",F37=\"AU\"),'meine Daten'!$C$12,IF(C37=\"Mo\",'meine Daten'!$C$21,IF(C37=\"Di\",'meine Daten'!$C$22,IF(C37=\"Mi\",'meine Daten'!$C$23,IF(C37=\"Do\",'meine Daten'!$C$24,IF(C37=\"Fr\",'meine Daten'!$C$25,IF(C37=\"Sa\",'meine Daten'!$C$26,IF(C37=\"So\",'meine Daten'!$C$27))))))))","v":"08:00:00"},"",null,null,null,"00:00:00",null,null,null,null,"00:00:00","00:00:00",null," ",{"$f":"IF(ISERROR(VLOOKUP(B37,Feiertage!$B$5:$B$21,1,FALSE)),WEEKDAY(B37,2),\"Feiertag\")","v":1},{"$f":"S36+IF(F37=\"Z\",-(#REF!*24),IF(G37=\"\",0,(O37+P37-D37)*24))","v":0}]
[null,"2023-03-28","Di",{"$f":"IF(OR(E38=\"F\",F38=\"U\",F38=\"AU\"),'meine Daten'!$C$12,IF(C38=\"Mo\",'meine Daten'!$C$21,IF(C38=\"Di\",'meine Daten'!$C$22,IF(C38=\"Mi\",'meine Daten'!$C$23,IF(C38=\"Do\",'meine Daten'!$C$24,IF(C38=\"Fr\",'meine Daten'!$C$25,IF(C38=\"Sa\",'meine Daten'!$C$26,IF(C38=\"So\",'meine Daten'!$C$27))))))))","v":"08:00:00"},"",null,null,null,"00:00:00",null,null,null,null,"00:00:00","00:00:00",null," ",{"$f":"IF(ISERROR(VLOOKUP(B38,Feiertage!$B$5:$B$21,1,FALSE)),WEEKDAY(B38,2),\"Feiertag\")","v":2},{"$f":"S37+IF(F38=\"Z\",-(#REF!*24),IF(G38=\"\",0,(O38+P38-D38)*24))","v":0},null,null,"Ich versichere die Richtigkeit meiner Angaben. Mir ist bekannt, "]
[null,"2023-03-29","Mi",{"$f":"IF(OR(E39=\"F\",F39=\"U\",F39=\"AU\"),'meine Daten'!$C$12,IF(C39=\"Mo\",'meine Daten'!$C$21,IF(C39=\"Di\",'meine Daten'!$C$22,IF(C39=\"Mi\",'meine Daten'!$C$23,IF(C39=\"Do\",'meine Daten'!$C$24,IF(C39=\"Fr\",'meine Daten'!$C$25,IF(C39=\"Sa\",'meine Daten'!$C$26,IF(C39=\"So\",'meine Daten'!$C$27))))))))","v":"08:00:00"},"",null,null,null,"00:00:00",null,null,null,null,"00:00:00","00:00:00",null," ",{"$f":"IF(ISERROR(VLOOKUP(B39,Feiertage!$B$5:$B$21,1,FALSE)),WEEKDAY(B39,2),\"Feiertag\")","v":3},{"$f":"S38+IF(F39=\"Z\",-(#REF!*24),IF(G39=\"\",0,(O39+P39-D39)*24))","v":0},null,null,"dass unrichtige Angaben eine grobe Pflichtverletzung darstellen. "]
[null,"2023-03-30","Do",{"$f":"IF(OR(E40=\"F\",F40=\"U\",F40=\"AU\"),'meine Daten'!$C$12,IF(C40=\"Mo\",'meine Daten'!$C$21,IF(C40=\"Di\",'meine Daten'!$C$22,IF(C40=\"Mi\",'meine Daten'!$C$23,IF(C40=\"Do\",'meine Daten'!$C$24,IF(C40=\"Fr\",'meine Daten'!$C$25,IF(C40=\"Sa\",'meine Daten'!$C$26,IF(C40=\"So\",'meine Daten'!$C$27))))))))","v":"08:00:00"},"",null,null,null,"00:00:00",null,null,null,null,"00:00:00","00:00:00",null," ",{"$f":"IF(ISERROR(VLOOKUP(B40,Feiertage!$B$5:$B$21,1,FALSE)),WEEKDAY(B40,2),\"Feiertag\")","v":4},{"$f":"S39+IF(F40=\"Z\",-(#REF!*24),IF(G40=\"\",0,(O40+P40-D40)*24))","v":0}]
[null,"2023-03-31","Fr",{"$f":"IF(OR(E41=\"F\",F41=\"U\",F41=\"AU\"),'meine Daten'!$C$12,IF(C41=\"Mo\",'meine Daten'!$C$21,IF(C41=\"Di\",'meine Daten'!$C$22,IF(C41=\"Mi\",'meine Daten'!$C$23,IF(C41=\"Do\",'meine Daten'!$C$24,IF(C41=\"Fr\",'meine Daten'!$C$25,IF(C41=\"Sa\",'meine Daten'!$C$26,IF(C41=\"So\",'meine Daten'!$C$27))))))))","v":"08:00:00"},null,null,null,null,"00:00:00",null,null,null,null,"00:00:00","00:00:00",null," ",{"$f":"IF(ISERROR(VLOOKUP(B41,Feiertage!$B$5:$B$21,1,FALSE)),WEEKDAY(B41,2),\"Feiertag\")","v":5},{"$f":"S40+IF(F41=\"Z\",-(#REF!*24),IF(G41=\"\",0,(O41+P41-D41)*24))","v":0}]
[null,null,null,null,null,{"$f":"COUNTIF(F13:F41,\"U\")+COUNTIF(F13:F41,\"Z\")+COUNTIF(F13:F41,AU)","v":0},{"$f":"IF(SUM(G13:G41)<=0,0,1)","v":0},null,null,null,null,null,null,null,null,null,{"$f":"SUM(Q11:Q41)","v":0}]
[null,null,null,null,null,null,null,null,null,null,null,null,null,"Monatssaldo:",null,null,{"$f":"IF(F42+G42=0,\"\",SUM(Q11:Q41))","v":""}]
[null,null,null,null,null,null,null,null,null,null,null,null,null,"Gleitzeitkontostand:",null,null,{"$f":"IF(OR(Q10=\"\",Q43=\"\"),\"\",Q10+Q43)","v":""},null,null,null,null,"Datum, Unterschrift"]
[null,null,null,null,null,null,null,null,null,null,null,null,null,"(In Stunden:Minuten)"]
[null,null,null,null,null,null,null,null,null,null,null,null,null,null,null,null,null,null,null,null,null,null,"„Der Arbeitszeit-Checker“ von Simone Back für www.arbeitszeit-klug-gestalten.de "]
[null,null,null,null,null,null,null,null,null,null,null,null,null,"Urlaubstage",null,null,{"$f":"COUNTIF(F11:F41,\"U\")","v":0}]
[null,null,null,null,null,null,null,null,null,null,null,null,null,null,null,null,null,null,null,null,null,null,"ist lizensiert unter einer Creative Commons Lizenz CC BY SA 4.0 \n(Nutzung bei Namensnennung, Weitergabe unter gleichen Bedingungen)"]
[null,null,null,null,null,null,null,null,null,null,null,null,null,null,null,null,null,null,null,null,null,"Copyright für das Logo \"Arbeitszeit klug gestalten\": RKW Hessen. Das Logo darf nur für den Checker in der Ursprungsform genutzt werden."]

{"sheet":"April","index":5,"n_rows":49,"n_cols":23,"rows_kept":49,"cut":false,"hidden":false,"merged":[[3,15,3,16],[6,1,8,1],[6,2,8,2],[6,3,8,3],[6,4,8,4],[6,5,8,5],[6,15,7,15],[7,9,7,10],[7,11,7,12],[45,22,46,25],[48,28,49,31],[9,1,9,15],[46,1,46,2],[47,22,47,25],[48,21,48,25]]}
[null,"Arbeitszeit-Nachweis",null,null,null,null,null,"Name:",null,{"$f":"IF('meine Daten'!C3=\"\",\"\",'meine Daten'!C3)","v":""},null,null,null,null,null,null,null,null,{"$f":"B11","v":"2023-04-01"},{"$f":"B11","v":"2023-04-01"}]
[]
[null,null,null,null,"Symbol* :  ","U","=Urlaub"]
[null,null,null,null,null,"AU","=Krank/Kur",null,null,null,null,null,null,null,"bedeutet:","Eintrag fehlt "]
[null,null,null,null,null,"Z","Zeitausgleich (ganzer Tag)",null,null,null,null,null,null,null,"bedeutet:","mehr als 10 Stunden"]
[]
[null,"Datum","Tag","Sollzeit","Feiertag","Symbol *","Brutto-Arbeitszeit",null,null,"Pausen",null,null,null,null,"Netto","weitere\nReisezeit","Saldo"]
[null,null,null,null,null,null,null,null,null,"Mittag",null,"weitere\n(Std:Min)",null,"Summe","Arbeits-\nzeit",null,"Arbeits-\nzeit"]
[null,null,null,null,null,null,"von","bis","Std:Min","von","bis","I","II","./.Std:Min","Std:Min","Std:Min","Std:Min",null,null,"Bemerkung"]
[null,"Übertrag vom Vormonat: ",null,null,null,null,null,null,null,null,null,null,null,null,null,null,{"$f":"März!Q44","v":""}]
[null,{"$f":"März!B41+1","v":"2023-04-01"},{"$f":"TEXT(B11,\"TTT\")","v":"Sa"},{"$f":"IF(OR(E11=\"F\",F11=\"U\",F11=\"AU\"),'meine Daten'!$C$12,IF(C11=\"Mo\",'meine Daten'!$C$29,IF(C11=\"Di\",'meine Daten'!$C$30,IF(C11=\"Mi\",'meine Daten'!$C$31,IF(C11=\"Do\",'meine Daten'!$C$32,IF(C11=\"Fr\",'meine Daten'!$C$33,IF(C11=\"Sa\",'meine Daten'!$C$34,IF(C11=\"So\",'meine Daten'!$C$35))))))))","v":"00:00:00"},{"$f":"IF(R11=\"Feiertag\",\"F\",\"\")","v":""},null,null,null,{"$f":"H11-G11","v":"00:00:00"},null,null,null,null,{"$f":"K11-J11+L11+M11","v":"00:00:00"},{"$f":"I11-N11","v":"00:00:00"},null,{"$f":"IF(F11=\"Z\",-(D11),IF(G11=\"\",\" \",IF(O11+P11>D11,O11+P11-D11,IF(O11+P11<D11,-(D11-O11-P11),\" \"))))","v":" "},{"$f":"IF(ISERROR(VLOOKUP(B11,Feiertage!$B$5:$B$21,1,FALSE)),WEEKDAY(B11,2),\"Feiertag\")","v":6},{"$f":"IF(G11=\"\",0,(O11+P11-D11)*24)","v":0}]
[null,{"$f":"B11+1","v":"2023-04-02"},{"$f":"TEXT(B12,\"TTT\")","v":"So"},{"$f":"IF(OR(E12=\"F\",F12=\"U\",F12=\"AU\"),'meine Daten'!$C$12,IF(C12=\"Mo\",'meine Daten'!$C$29,IF(C12=\"Di\",'meine Daten'!$C$30,IF(C12=\"Mi\",'meine Daten'!$C$31,IF(C12=\"Do\",'meine Daten'!$C$32,IF(C12=\"Fr\",'meine Daten'!$C$33,IF(C12=\"Sa\",'meine Daten'!$C$34,IF(C12=\"So\",'meine Daten'!$C$35))))))))","v":"00:00:00"},"",null,null,null,{"$f":"H12-G12","v":"00:00:00"},null,null,null,null,{"$f":"K12-J12+L12+M12","v":"00:00:00"},"00:00:00",null,{"$f":"IF(F12=\"Z\",-(D12),IF(G12=\"\",\" \",IF(O12+P12>D12,O12+P12-D12,IF(O12+P12<D12,-(D12-O12-P12),\" \"))))","v":" "},{"$f":"IF(ISERROR(VLOOKUP(B12,Feiertage!$B$5:$B$21,1,FALSE)),WEEKDAY(B12,2),\"Feiertag\")","v":7},{"$f":"S11+IF(F12=\"Z\",-(#REF!*24),IF(G12=\"\",0,(O12+P12-D12)*24))","v":0}]
[null,{"$f":"B12+1","v":"2023-04-03"},"Mo",{"$f":"IF(OR(E13=\"F\",F13=\"U\",F13=\"AU\"),'meine Daten'!$C$12,IF(C13=\"Mo\",'meine Daten'!$C$29,IF(C13=\"Di\",'meine Daten'!$C$30,IF(C13=\"Mi\",'meine Daten'!$C$31,IF(C13=\"Do\",'meine Daten'!$C$32,IF(C13=\"Fr\",'meine Daten'!$C$33,IF(C13=\"Sa\",'meine Daten'!$C$34,IF(C13=\"So\",'meine Daten'!$C$35))))))))","v":"08:00:00"},"",null,null,null,{"$f":"H13-G13","v":"00:00:00"},null,null,null,null,"00:00:00","00:00:00",null," ",{"$f":"IF(ISERROR(VLOOKUP(B13,Feiertage!$B$5:$B$21,1,FALSE)),WEEKDAY(B13,2),\"Feiertag\")","v":1},{"$f":"S12+IF(F13=\"Z\",-(#REF!*24),IF(G13=\"\",0,(O13+P13-D13)*24))","v":0}]
[null,{"$f":"B13+1","v":"2023-04-04"},"Di",{"$f":"IF(OR(E14=\"F\",F14=\"U\",F14=\"AU\"),'meine Daten'!$C$12,IF(C14=\"Mo\",'meine Daten'!$C$29,IF(C14=\"Di\",'meine Daten'!$C$30,IF(C14=\"Mi\",'meine Daten'!$C$31,IF(C14=\"Do\",'meine Daten'!$C$32,IF(C14=\"Fr\",'meine Daten'!$C$33,IF(C14=\"Sa\",'meine Daten'!$C$34,IF(C14=\"So\",'meine Daten'!$C$35))))))))","v":"08:00:00"},"",null,null,null,"00:00:00",null,null,null,null,"00:00:00","00:00:00",null," ",{"$f":"IF(ISERROR(VLOOKUP(B14,Feiertage!$B$5:$B$21,1,FALSE)),WEEKDAY(B14,2),\"Feiertag\")","v":2},{"$f":"S13+IF(F14=\"Z\",-(#REF!*24),IF(G14=\"\",0,(O14+P14-D14)*24))","v":0}]
[null,"2023-04-05","Mi",{"$f":"IF(OR(E15=\"F\",F15=\"U\",F15=\"AU\"),'meine Daten'!$C$12,IF(C15=\"Mo\",'meine Daten'!$C$29,IF(C15=\"Di\",'meine Daten'!$C$30,IF(C15=\"Mi\",'meine Daten'!$C$31,IF(C15=\"Do\",'meine Daten'!$C$32,IF(C15=\"Fr\",'meine Daten'!$C$33,IF(C15=\"Sa\",'meine Daten'!$C$34,IF(C15=\"So\",'meine Daten'!$C$35))))))))","v":"08:00:00"},"",null,null,null,"00:00:00",null,null,null,null,"00:00:00","00:00:00",null," ",{"$f":"IF(ISERROR(VLOOKUP(B15,Feiertage!$B$5:$B$21,1,FALSE)),WEEKDAY(B15,2),\"Feiertag\")","v":3},{"$f":"S14+IF(F15=\"Z\",-(#REF!*24),IF(G15=\"\",0,(O15+P15-D15)*24))","v":0}]
[null,"2023-04-06","Do",{"$f":"IF(OR(E16=\"F\",F16=\"U\",F16=\"AU\"),'meine Daten'!$C$12,IF(C16=\"Mo\",'meine Daten'!$C$29,IF(C16=\"Di\",'meine Daten'!$C$30,IF(C16=\"Mi\",'meine Daten'!$C$31,IF(C16=\"Do\",'meine Daten'!$C$32,IF(C16=\"Fr\",'meine Daten'!$C$33,IF(C16=\"Sa\",'meine Daten'!$C$34,IF(C16=\"So\",'meine Daten'!$C$35))))))))","v":"08:00:00"},"",null,null,null,"00:00:00",null,null,null,null,"00:00:00","00:00:00",null," ",{"$f":"IF(ISERROR(VLOOKUP(B16,Feiertage!$B$5:$B$21,1,FALSE)),WEEKDAY(B16,2),\"Feiertag\")","v":4},{"$f":"S15+IF(F16=\"Z\",-(#REF!*24),IF(G16=\"\",0,(O16+P16-D16)*24))","v":0}]
[null,"2023-04-07","Fr",{"$f":"IF(OR(E17=\"F\",F17=\"U\",F17=\"AU\"),'meine Daten'!$C$12,IF(C17=\"Mo\",'meine Daten'!$C$29,IF(C17=\"Di\",'meine Daten'!$C$30,IF(C17=\"Mi\",'meine Daten'!$C$31,IF(C17=\"Do\",'meine Daten'!$C$32,IF(C17=\"Fr\",'meine Daten'!$C$33,IF(C17=\"Sa\",'meine Daten'!$C$34,IF(C17=\"So\",'meine Daten'!$C$35))))))))","v":"00:00:00"},"F",null,null,null,"00:00:00",null,null,null,null,"00:00:00","00:00:00",null," ",{"$f":"IF(ISERROR(VLOOKUP(B17,Feiertage!$B$5:$B$21,1,FALSE)),WEEKDAY(B17,2),\"Feiertag\")","v":"Feiertag"},{"$f":"S16+IF(F17=\"Z\",-(#REF!*24),IF(G17=\"\",0,(O17+P17-D17)*24))","v":0}]
[null,"2023-04-08","Sa",{"$f":"IF(OR(E18=\"F\",F18=\"U\",F18=\"AU\"),'meine Daten'!$C$12,IF(C18=\"Mo\",'meine Daten'!$C$29,IF(C18=\"Di\",'meine Daten'!$C$30,IF(C18=\"Mi\",'meine Daten'!$C$31,IF(C18=\"Do\",'meine Daten'!$C$32,IF(C18=\"Fr\",'meine Daten'!$C$33,IF(C18=\"Sa\",'meine Daten'!$C$34,IF(C18=\"So\",'meine Daten'!$C$35))))))))","v":"00:00:00"},"",null,null,null,"00:00:00",null,null,null,null,"00:00:00","00:00:00",null," ",{"$f":"IF(ISERROR(VLOOKUP(B18,Feiertage!$B$5:$B$21,1,FALSE)),WEEKDAY(B18,2),\"Feiertag\")","v":6},{"$f":"S17+IF(F18=\"Z\",-(#REF!*24),IF(G18=\"\",0,(O18+P18-D18)*24))","v":0}]
[null,"2023-04-09","So",{"$f":"IF(OR(E19=\"F\",F19=\"U\",F19=\"AU\"),'meine Daten'!$C$12,IF(C19=\"Mo\",'meine Daten'!$C$29,IF(C19=\"Di\",'meine Daten'!$C$30,IF(C19=\"Mi\",'meine Daten'!$C$31,IF(C19=\"Do\",'meine Daten'!$C$32,IF(C19=\"Fr\",'meine Daten'!$C$33,IF(C19=\"Sa\",'meine Daten'!$C$34,IF(C19=\"So\",'meine Daten'!$C$35))))))))","v":"00:00:00"},"",null,null,null,"00:00:00",null,null,null,null,"00:00:00","00:00:00",null," ",{"$f":"IF(ISERROR(VLOOKUP(B19,Feiertage!$B$5:$B$21,1,FALSE)),WEEKDAY(B19,2),\"Feiertag\")","v":7},{"$f":"S18+IF(F19=\"Z\",-(#REF!*24),IF(G19=\"\",0,(O19+P19-D19)*24))","v":0}]
[null,"2023-04-10","Mo",{"$f":"IF(OR(E20=\"F\",F20=\"U\",F20=\"AU\"),'meine Daten'!$C$12,IF(C20=\"Mo\",'meine Daten'!$C$29,IF(C20=\"Di\",'meine Daten'!$C$30,IF(C20=\"Mi\",'meine Daten'!$C$31,IF(C20=\"Do\",'meine Daten'!$C$32,IF(C20=\"Fr\",'meine Daten'!$C$33,IF(C20=\"Sa\",'meine Daten'!$C$34,IF(C20=\"So\",'meine Daten'!$C$35))))))))","v":"00:00:00"},"F",null,null,null,"00:00:00",null,null,null,null,"00:00:00","00:00:00",null," ",{"$f":"IF(ISERROR(VLOOKUP(B20,Feiertage!$B$5:$B$21,1,FALSE)),WEEKDAY(B20,2),\"Feiertag\")","v":"Feiertag"},{"$f":"S19+IF(F20=\"Z\",-(#REF!*24),IF(G20=\"\",0,(O20+P20-D20)*24))","v":0}]
[null,"2023-04-11","Di",{"$f":"IF(OR(E21=\"F\",F21=\"U\",F21=\"AU\"),'meine Daten'!$C$12,IF(C21=\"Mo\",'meine Daten'!$C$29,IF(C21=\"Di\",'meine Daten'!$C$30,IF(C21=\"Mi\",'meine Daten'!$C$31,IF(C21=\"Do\",'meine Daten'!$C$32,IF(C21=\"Fr\",'meine Daten'!$C$33,IF(C21=\"Sa\",'meine Daten'!$C$34,IF(C21=\"So\",'meine Daten'!$C$35))))))))","v":"08:00:00"},"",null,null,null,"00:00:00",null,null,null,null,"00:00:00","00:00:00",null," ",{"$f":"IF(ISERROR(VLOOKUP(B21,Feiertage!$B$5:$B$21,1,FALSE)),WEEKDAY(B21,2),\"Feiertag\")","v":2},{"$f":"S20+IF(F21=\"Z\",-(#REF!*24),IF(G21=\"\",0,(O21+P21-D21)*24))","v":0}]
[null,"2023-04-12","Mi",{"$f":"IF(OR(E22=\"F\",F22=\"U\",F22=\"AU\"),'meine Daten'!$C$12,IF(C22=\"Mo\",'meine Daten'!$C$29,IF(C22=\"Di\",'meine Daten'!$C$30,IF(C22=\"Mi\",'meine Daten'!$C$31,IF(C22=\"Do\",'meine Daten'!$C$32,IF(C22=\"Fr\",'meine Daten'!$C$33,IF(C22=\"Sa\",'meine Daten'!$C$34,IF(C22=\"So\",'meine Daten'!$C$35))))))))","v":"08:00:00"},"",null,null,null,"00:00:00",null,null,null,null,"00:00:00","00:00:00",null," ",{"$f":"IF(ISERROR(VLOOKUP(B22,Feiertage!$B$5:$B$21,1,FALSE)),WEEKDAY(B22,2),\"Feiertag\")","v":3},{"$f":"S21+IF(F22=\"Z\",-(#REF!*24),IF(G22=\"\",0,(O22+P22-D22)*24))","v":0}]
[null,"2023-04-13","Do",{"$f":"IF(OR(E23=\"F\",F23=\"U\",F23=\"AU\"),'meine Daten'!$C$12,IF(C23=\"Mo\",'meine Daten'!$C$29,IF(C23=\"Di\",'meine Daten'!$C$30,IF(C23=\"Mi\",'meine Daten'!$C$31,IF(C23=\"Do\",'meine Daten'!$C$32,IF(C23=\"Fr\",'meine Daten'!$C$33,IF(C23=\"Sa\",'meine Daten'!$C$34,IF(C23=\"So\",'meine Daten'!$C$35))))))))","v":"08:00:00"},"",null,null,null,"00:00:00",null,null,null,null,"00:00:00","00:00:00",null," ",{"$f":"IF(ISERROR(VLOOKUP(B23,Feiertage!$B$5:$B$21,1,FALSE)),WEEKDAY(B23,2),\"Feiertag\")","v":4},{"$f":"S22+IF(F23=\"Z\",-(#REF!*24),IF(G23=\"\",0,(O23+P23-D23)*24))","v":0}]
[null,"2023-04-14","Fr",{"$f":"IF(OR(E24=\"F\",F24=\"U\",F24=\"AU\"),'meine Daten'!$C$12,IF(C24=\"Mo\",'meine Daten'!$C$29,IF(C24=\"Di\",'meine Daten'!$C$30,IF(C24=\"Mi\",'meine Daten'!$C$31,IF(C24=\"Do\",'meine Daten'!$C$32,IF(C24=\"Fr\",'meine Daten'!$C$33,IF(C24=\"Sa\",'meine Daten'!$C$34,IF(C24=\"So\",'meine Daten'!$C$35))))))))","v":"08:00:00"},"",null,null,null,"00:00:00",null,null,null,null,"00:00:00","00:00:00",null," ",{"$f":"IF(ISERROR(VLOOKUP(B24,Feiertage!$B$5:$B$21,1,FALSE)),WEEKDAY(B24,2),\"Feiertag\")","v":5},{"$f":"S23+IF(F24=\"Z\",-(#REF!*24),IF(G24=\"\",0,(O24+P24-D24)*24))","v":0}]
[null,"2023-04-15","Sa",{"$f":"IF(OR(E25=\"F\",F25=\"U\",F25=\"AU\"),'meine Daten'!$C$12,IF(C25=\"Mo\",'meine Daten'!$C$29,IF(C25=\"Di\",'meine Daten'!$C$30,IF(C25=\"Mi\",'meine Daten'!$C$31,IF(C25=\"Do\",'meine Daten'!$C$32,IF(C25=\"Fr\",'meine Daten'!$C$33,IF(C25=\"Sa\",'meine Daten'!$C$34,IF(C25=\"So\",'meine Daten'!$C$35))))))))","v":"00:00:00"},"",null,null,null,"00:00:00",null,null,null,null,"00:00:00","00:00:00",null," ",{"$f":"IF(ISERROR(VLOOKUP(B25,Feiertage!$B$5:$B$21,1,FALSE)),WEEKDAY(B25,2),\"Feiertag\")","v":6},{"$f":"S24+IF(F25=\"Z\",-(#REF!*24),IF(G25=\"\",0,(O25+P25-D25)*24))","v":0}]
[null,"2023-04-16","So",{"$f":"IF(OR(E26=\"F\",F26=\"U\",F26=\"AU\"),'meine Daten'!$C$12,IF(C26=\"Mo\",'meine Daten'!$C$29,IF(C26=\"Di\",'meine Daten'!$C$30,IF(C26=\"Mi\",'meine Daten'!$C$31,IF(C26=\"Do\",'meine Daten'!$C$32,IF(C26=\"Fr\",'meine Daten'!$C$33,IF(C26=\"Sa\",'meine Daten'!$C$34,IF(C26=\"So\",'meine Daten'!$C$35))))))))","v":"00:00:00"},"",null,null,null,"00:00:00",null,null,null,null,"00:00:00","00:00:00",null," ",{"$f":"IF(ISERROR(VLOOKUP(B26,Feiertage!$B$5:$B$21,1,FALSE)),WEEKDAY(B26,2),\"Feiertag\")","v":7},{"$f":"S25+IF(F26=\"Z\",-(#REF!*24),IF(G26=\"\",0,(O26+P26-D26)*24))","v":0}]
[null,"2023-04-17","Mo",{"$f":"IF(OR(E27=\"F\",F27=\"U\",F27=\"AU\"),'meine Daten'!$C$12,IF(C27=\"Mo\",'meine Daten'!$C$29,IF(C27=\"Di\",'meine Daten'!$C$30,IF(C27=\"Mi\",'meine Daten'!$C$31,IF(C27=\"Do\",'meine Daten'!$C$32,IF(C27=\"Fr\",'meine Daten'!$C$33,IF(C27=\"Sa\",'meine Daten'!$C$34,IF(C27=\"So\",'meine Daten'!$C$35))))))))","v":"08:00:00"},"",null,null,null,"00:00:00",null,null,null,null,"00:00:00","00:00:00",null," ",{"$f":"IF(ISERROR(VLOOKUP(B27,Feiertage!$B$5:$B$21,1,FALSE)),WEEKDAY(B27,2),\"Feiertag\")","v":1},{"$f":"S26+IF(F27=\"Z\",-(#REF!*24),IF(G27=\"\",0,(O27+P27-D27)*24))","v":0}]
[null,"2023-04-18","Di",{"$f":"IF(OR(E28=\"F\",F28=\"U\",F28=\"AU\"),'meine Daten'!$C$12,IF(C28=\"Mo\",'meine Daten'!$C$29,IF(C28=\"Di\",'meine Daten'!$C$30,IF(C28=\"Mi\",'meine Daten'!$C$31,IF(C28=\"Do\",'meine Daten'!$C$32,IF(C28=\"Fr\",'meine Daten'!$C$33,IF(C28=\"Sa\",'meine Daten'!$C$34,IF(C28=\"So\",'meine Daten'!$C$35))))))))","v":"08:00:00"},"",null,null,null,"00:00:00",null,null,null,null,"00:00:00","00:00:00",null," ",{"$f":"IF(ISERROR(VLOOKUP(B28,Feiertage!$B$5:$B$21,1,FALSE)),WEEKDAY(B28,2),\"Feiertag\")","v":2},{"$f":"S27+IF(F28=\"Z\",-(#REF!*24),IF(G28=\"\",0,(O28+P28-D28)*24))","v":0}]
[null,"2023-04-19","Mi",{"$f":"IF(OR(E29=\"F\",F29=\"U\",F29=\"AU\"),'meine Daten'!$C$12,IF(C29=\"Mo\",'meine Daten'!$C$29,IF(C29=\"Di\",'meine Daten'!$C$30,IF(C29=\"Mi\",'meine Daten'!$C$31,IF(C29=\"Do\",'meine Daten'!$C$32,IF(C29=\"Fr\",'meine Daten'!$C$33,IF(C29=\"Sa\",'meine Daten'!$C$34,IF(C29=\"So\",'meine Daten'!$C$35))))))))","v":"08:00:00"},"",null,null,null,"00:00:00",null,null,null,null,"00:00:00","00:00:00",null," ",{"$f":"IF(ISERROR(VLOOKUP(B29,Feiertage!$B$5:$B$21,1,FALSE)),WEEKDAY(B29,2),\"Feiertag\")","v":3},{"$f":"S28+IF(F29=\"Z\",-(#REF!*24),IF(G29=\"\",0,(O29+P29-D29)*24))","v":0}]
[null,"2023-04-20","Do",{"$f":"IF(OR(E30=\"F\",F30=\"U\",F30=\"AU\"),'meine Daten'!$C$12,IF(C30=\"Mo\",'meine Daten'!$C$29,IF(C30=\"Di\",'meine Daten'!$C$30,IF(C30=\"Mi\",'meine Daten'!$C$31,IF(C30=\"Do\",'meine Daten'!$C$32,IF(C30=\"Fr\",'meine Daten'!$C$33,IF(C30=\"Sa\",'meine Daten'!$C$34,IF(C30=\"So\",'meine Daten'!$C$35))))))))","v":"08:00:00"},"",null,null,null,"00:00:00",null,null,null,null,"00:00:00","00:00:00",null," ",{"$f":"IF(ISERROR(VLOOKUP(B30,Feiertage!$B$5:$B$21,1,FALSE)),WEEKDAY(B30,2),\"Feiertag\")","v":4},{"$f":"S29+IF(F30=\"Z\",-(#REF!*24),IF(G30=\"\",0,(O30+P30-D30)*24))","v":0}]
[null,"2023-04-21","Fr",{"$f":"IF(OR(E31=\"F\",F31=\"U\",F31=\"AU\"),'meine Daten'!$C$12,IF(C31=\"Mo\",'meine Daten'!$C$29,IF(C31=\"Di\",'meine Daten'!$C$30,IF(C31=\"Mi\",'meine Daten'!$C$31,IF(C31=\"Do\",'meine Daten'!$C$32,IF(C31=\"Fr\",'meine Daten'!$C$33,IF(C31=\"Sa\",'meine Daten'!$C$34,IF(C31=\"So\",'meine Daten'!$C$35))))))))","v":"08:00:00"},"",null,null,null,"00:00:00",null,null,null,null,"00:00:00","00:00:00",null," ",{"$f":"IF(ISERROR(VLOOKUP(B31,Feiertage!$B$5:$B$21,1,FALSE)),WEEKDAY(B31,2),\"Feiertag\")","v":5},{"$f":"S30+IF(F31=\"Z\",-(#REF!*24),IF(G31=\"\",0,(O31+P31-D31)*24))","v":0}]
[null,"2023-04-22","Sa",{"$f":"IF(OR(E32=\"F\",F32=\"U\",F32=\"AU\"),'meine Daten'!$C$12,IF(C32=\"Mo\",'meine Daten'!$C$29,IF(C32=\"Di\",'meine Daten'!$C$30,IF(C32=\"Mi\",'meine Daten'!$C$31,IF(C32=\"Do\",'meine Daten'!$C$32,IF(C32=\"Fr\",'meine Daten'!$C$33,IF(C32=\"Sa\",'meine Daten'!$C$34,IF(C32=\"So\",'meine Daten'!$C$35))))))))","v":"00:00:00"},"",null,null,null,"00:00:00",null,null,null,null,"00:00:00","00:00:00",null," ",{"$f":"IF(ISERROR(VLOOKUP(B32,Feiertage!$B$5:$B$21,1,FALSE)),WEEKDAY(B32,2),\"Feiertag\")","v":6},{"$f":"S31+IF(F32=\"Z\",-(#REF!*24),IF(G32=\"\",0,(O32+P32-D32)*24))","v":0}]
[null,"2023-04-23","So",{"$f":"IF(OR(E33=\"F\",F33=\"U\",F33=\"AU\"),'meine Daten'!$C$12,IF(C33=\"Mo\",'meine Daten'!$C$29,IF(C33=\"Di\",'meine Daten'!$C$30,IF(C33=\"Mi\",'meine Daten'!$C$31,IF(C33=\"Do\",'meine Daten'!$C$32,IF(C33=\"Fr\",'meine Daten'!$C$33,IF(C33=\"Sa\",'meine Daten'!$C$34,IF(C33=\"So\",'meine Daten'!$C$35))))))))","v":"00:00:00"},"",null,null,null,"00:00:00",null,null,null,null,"00:00:00","00:00:00",null," ",{"$f":"IF(ISERROR(VLOOKUP(B33,Feiertage!$B$5:$B$21,1,FALSE)),WEEKDAY(B33,2),\"Feiertag\")","v":7},{"$f":"S32+IF(F33=\"Z\",-(#REF!*24),IF(G33=\"\",0,(O33+P33-D33)*24))","v":0}]
[null,"2023-04-24","Mo",{"$f":"IF(OR(E34=\"F\",F34=\"U\",F34=\"AU\"),'meine Daten'!$C$12,IF(C34=\"Mo\",'meine Daten'!$C$29,IF(C34=\"Di\",'meine Daten'!$C$30,IF(C34=\"Mi\",'meine Daten'!$C$31,IF(C34=\"Do\",'meine Daten'!$C$32,IF(C34=\"Fr\",'meine Daten'!$C$33,IF(C34=\"Sa\",'meine Daten'!$C$34,IF(C34=\"So\",'meine Daten'!$C$35))))))))","v":"08:00:00"},"",null,null,null,"00:00:00",null,null,null,null,"00:00:00","00:00:00",null," ",{"$f":"IF(ISERROR(VLOOKUP(B34,Feiertage!$B$5:$B$21,1,FALSE)),WEEKDAY(B34,2),\"Feiertag\")","v":1},{"$f":"S33+IF(F34=\"Z\",-(#REF!*24),IF(G34=\"\",0,(O34+P34-D34)*24))","v":0}]
[null,"2023-04-25","Di",{"$f":"IF(OR(E35=\"F\",F35=\"U\",F35=\"AU\"),'meine Daten'!$C$12,IF(C35=\"Mo\",'meine Daten'!$C$29,IF(C35=\"Di\",'meine Daten'!$C$30,IF(C35=\"Mi\",'meine Daten'!$C$31,IF(C35=\"Do\",'meine Daten'!$C$32,IF(C35=\"Fr\",'meine Daten'!$C$33,IF(C35=\"Sa\",'meine Daten'!$C$34,IF(C35=\"So\",'meine Daten'!$C$35))))))))","v":"08:00:00"},"",null,null,null,"00:00:00",null,null,null,null,"00:00:00","00:00:00",null," ",{"$f":"IF(ISERROR(VLOOKUP(B35,Feiertage!$B$5:$B$21,1,FALSE)),WEEKDAY(B35,2),\"Feiertag\")","v":2},{"$f":"S34+IF(F35=\"Z\",-(#REF!*24),IF(G35=\"\",0,(O35+P35-D35)*24))","v":0}]
[null,"2023-04-26","Mi",{"$f":"IF(OR(E36=\"F\",F36=\"U\",F36=\"AU\"),'meine Daten'!$C$12,IF(C36=\"Mo\",'meine Daten'!$C$29,IF(C36=\"Di\",'meine Daten'!$C$30,IF(C36=\"Mi\",'meine Daten'!$C$31,IF(C36=\"Do\",'meine Daten'!$C$32,IF(C36=\"Fr\",'meine Daten'!$C$33,IF(C36=\"Sa\",'meine Daten'!$C$34,IF(C36=\"So\",'meine Daten'!$C$35))))))))","v":"08:00:00"},"",null,null,null,"00:00:00",null,null,null,null,"00:00:00","00:00:00",null," ",{"$f":"IF(ISERROR(VLOOKUP(B36,Feiertage!$B$5:$B$21,1,FALSE)),WEEKDAY(B36,2),\"Feiertag\")","v":3},{"$f":"S35+IF(F36=\"Z\",-(#REF!*24),IF(G36=\"\",0,(O36+P36-D36)*24))","v":0}]
[null,"2023-04-27","Do",{"$f":"IF(OR(E37=\"F\",F37=\"U\",F37=\"AU\"),'meine Daten'!$C$12,IF(C37=\"Mo\",'meine Daten'!$C$29,IF(C37=\"Di\",'meine Daten'!$C$30,IF(C37=\"Mi\",'meine Daten'!$C$31,IF(C37=\"Do\",'meine Daten'!$C$32,IF(C37=\"Fr\",'meine Daten'!$C$33,IF(C37=\"Sa\",'meine Daten'!$C$34,IF(C37=\"So\",'meine Daten'!$C$35))))))))","v":"08:00:00"},"",null,null,null,"00:00:00",null,null,null,null,"00:00:00","00:00:00",null," ",{"$f":"IF(ISERROR(VLOOKUP(B37,Feiertage!$B$5:$B$21,1,FALSE)),WEEKDAY(B37,2),\"Feiertag\")","v":4},{"$f":"S36+IF(F37=\"Z\",-(#REF!*24),IF(G37=\"\",0,(O37+P37-D37)*24))","v":0}]
[null,"2023-04-28","Fr",{"$f":"IF(OR(E38=\"F\",F38=\"U\",F38=\"AU\"),'meine Daten'!$C$12,IF(C38=\"Mo\",'meine Daten'!$C$29,IF(C38=\"Di\",'meine Daten'!$C$30,IF(C38=\"Mi\",'meine Daten'!$C$31,IF(C38=\"Do\",'meine Daten'!$C$32,IF(C38=\"Fr\",'meine Daten'!$C$33,IF(C38=\"Sa\",'meine Daten'!$C$34,IF(C38=\"So\",'meine Daten'!$C$35))))))))","v":"08:00:00"},"",null,null,null,"00:00:00",null,null,null,null,"00:00:00","00:00:00",null," ",{"$f":"IF(ISERROR(VLOOKUP(B38,Feiertage!$B$5:$B$21,1,FALSE)),WEEKDAY(B38,2),\"Feiertag\")","v":5},{"$f":"S37+IF(F38=\"Z\",-(#REF!*24),IF(G38=\"\",0,(O38+P38-D38)*24))","v":0},null,null,"Ich versichere die Richtigkeit meiner Angaben. Mir ist bekannt, "]
[null,"2023-04-29","Sa",{"$f":"IF(OR(E39=\"F\",F39=\"U\",F39=\"AU\"),'meine Daten'!$C$12,IF(C39=\"Mo\",'meine Daten'!$C$29,IF(C39=\"Di\",'meine Daten'!$C$30,IF(C39=\"Mi\",'meine Daten'!$C$31,IF(C39=\"Do\",'meine Daten'!$C$32,IF(C39=\"Fr\",'meine Daten'!$C$33,IF(C39=\"Sa\",'meine Daten'!$C$34,IF(C39=\"So\",'meine Daten'!$C$35))))))))","v":"00:00:00"},"",null,null,null,"00:00:00",null,null,null,null,"00:00:00","00:00:00",null," ",{"$f":"IF(ISERROR(VLOOKUP(B39,Feiertage!$B$5:$B$21,1,FALSE)),WEEKDAY(B39,2),\"Feiertag\")","v":6},{"$f":"S38+IF(F39=\"Z\",-(#REF!*24),IF(G39=\"\",0,(O39+P39-D39)*24))","v":0},null,null,"dass unrichtige Angaben eine grobe Pflichtverletzung darstellen. "]
[null,"2023-04-30","So",{"$f":"IF(OR(E40=\"F\",F40=\"U\",F40=\"AU\"),'meine Daten'!$C$12,IF(C40=\"Mo\",'meine Daten'!$C$29,IF(C40=\"Di\",'meine Daten'!$C$30,IF(C40=\"Mi\",'meine Daten'!$C$31,IF(C40=\"Do\",'meine Daten'!$C$32,IF(C40=\"Fr\",'meine Daten'!$C$33,IF(C40=\"Sa\",'meine Daten'!$C$34,IF(C40=\"So\",'meine Daten'!$C$35))))))))","v":"00:00:00"},null,null,null,null,"00:00:00",null,null,null,null,"00:00:00","00:00:00",null," ",{"$f":"IF(ISERROR(VLOOKUP(B40,Feiertage!$B$5:$B$21,1,FALSE)),WEEKDAY(B40,2),\"Feiertag\")","v":7},{"$f":"#REF!+IF(F40=\"Z\",-(#REF!*24),IF(G40=\"\",0,(O40+P40-D40)*24))","v":{"$error":"#REF!"}}]
[null,null,null,null,null,{"$f":"COUNTIF(F13:F40,\"U\")+COUNTIF(F13:F40,\"Z\")+COUNTIF(F13:F40,AU)","v":0},{"$f":"IF(SUM(G13:G40)<=0,0,1)","v":0},null,null,null,null,null,null,null,null,null,{"$f":"SUM(Q11:Q40)","v":0}]
[null,null,null,null,null,null,null,null,null,null,null,null,null,"Monatssaldo:",null,null,{"$f":"IF(F41+G41=0,\"\",SUM(Q11:Q40))","v":""}]
[null,null,null,null,null,null,null,null,null,null,null,null,null,"Gleitzeitkontostand:",null,null,{"$f":"IF(OR(Q10=\"\",Q42=\"\"),\"\",Q10+Q42)","v":""}]
[null,null,null,null,null,null,null,null,null,null,null,null,null,"(In Stunden:Minuten)",null,null,null,null,null,null,null,"Datum, Unterschrift"]
[]
[null,null,null,null,null,null,null,null,null,null,null,null,null,"Urlaubstage",null,null,{"$f":"COUNTIF(F11:F40,\"U\")","v":0},null,null,null,null,null,"„Der Arbeitszeit-Checker“ von Simone Back für www.arbeitszeit-klug-gestalten.de "]
[]
[null,null,null,null,null,null,null,null,null,null,null,null,null,null,null,null,null,null,null,null,null,null,"ist lizensiert unter einer Creative Commons Lizenz CC BY SA 4.0 \n(Nutzung bei Namensnennung, Weitergabe unter gleichen Bedingungen)"]
[null,null,null,null,null,null,null,null,null,null,null,null,null,null,null,null,null,null,null,null,null,"Copyright für das Logo \"Arbeitszeit klug gestalten\": RKW Hessen. Das Logo darf nur für den Checker in der Ursprungsform genutzt werden."]

{"sheet":"Mai","index":6,"n_rows":49,"n_cols":23,"rows_kept":49,"cut":false,"hidden":false,"merged":[[48,21,48,25],[45,22,46,25],[9,1,9,15],[47,1,47,2],[3,15,3,16],[6,1,8,1],[6,2,8,2],[6,3,8,3],[6,4,8,4],[6,5,8,5],[6,15,7,15],[7,9,7,10],[7,11,7,12],[47,22,47,25]]}
[null,"Arbeitszeit-Nachweis",null,null,null,null,null,"Name:",null,{"$f":"IF('meine Daten'!C3=\"\",\"\",'meine Daten'!C3)","v":""},null,null,null,null,null,null,null,null,{"$f":"B11","v":"2023-05-01"},{"$f":"B11","v":"2023-05-01"}]
[]
[null,null,null,null,"Symbol* :  ","U","=Urlaub"]
[null,null,null,null,null,"AU","=Krank/Kur",null,null,null,null,null,null,null,"bedeutet:","Eintrag fehlt "]
[null,null,null,null,null,"Z","Zeitausgleich (ganzer Tag)",null,null,null,null,null,null,null,"bedeutet:","mehr als 10 Stunden"]
[]
[null,"Datum","Tag","Sollzeit","Feiertag","Symbol *","Brutto-Arbeitszeit",null,null,"Pausen",null,null,null,null,"Netto","weitere\nReisezeit","Saldo"]
[null,null,null,null,null,null,null,null,null,"Mittag",null,"weitere\n(Std:Min)",null,"Summe","Arbeits-\nzeit",null,"Arbeits-\nzeit"]
[null,null,null,null,null,null,"von","bis","Std:Min","von","bis","I","II","./.Std:Min","Std:Min","Std:Min","Std:Min",null,null,"Bemerkung"]
[null,"Übertrag vom Vormonat: ",null,null,null,null,null,null,null,null,null,null,null,null,null,null,{"$f":"April!Q43","v":""}]
[null,{"$f":"April!B40+1","v":"2023-05-01"},{"$f":"TEXT(B11,\"TTT\")","v":"Mo"},{"$f":"IF(OR(E11=\"F\",F11=\"U\",F11=\"AU\"),'meine Daten'!$C$12,IF(C11=\"Mo\",'meine Daten'!$H$5,IF(C11=\"Di\",'meine Daten'!$H$6,IF(C11=\"Mi\",'meine Daten'!$H$7,IF(C11=\"Do\",'meine Daten'!$H$8,IF(C11=\"Fr\",'meine Daten'!$H$9,IF(C11=\"Sa\",'meine Daten'!$H$10,IF(C11=\"So\",'meine Daten'!$H$11))))))))","v":"00:00:00"},{"$f":"IF(R11=\"Feiertag\",\"F\",\"\")","v":"F"},null,null,null,{"$f":"H11-G11","v":"00:00:00"},null,null,null,null,{"$f":"K11-J11+L11+M11","v":"00:00:00"},{"$f":"I11-N11","v":"00:00:00"},null,{"$f":"IF(F11=\"Z\",-(D11),IF(G11=\"\",\" \",IF(O11+P11>D11,O11+P11-D11,IF(O11+P11<D11,-(D11-O11-P11),\" \"))))","v":" "},{"$f":"IF(ISERROR(VLOOKUP(B11,Feiertage!$B$5:$B$21,1,FALSE)),WEEKDAY(B11,2),\"Feiertag\")","v":"Feiertag"},{"$f":"IF(G11=\"\",0,(O11+P11-D11)*24)","v":0}]
[null,{"$f":"B11+1","v":"2023-05-02"},{"$f":"TEXT(B12,\"TTT\")","v":"Di"},{"$f":"IF(OR(E12=\"F\",F12=\"U\",F12=\"AU\"),'meine Daten'!$C$12,IF(C12=\"Mo\",'meine Daten'!$H$5,IF(C12=\"Di\",'meine Daten'!$H$6,IF(C12=\"Mi\",'meine Daten'!$H$7,IF(C12=\"Do\",'meine Daten'!$H$8,IF(C12=\"Fr\",'meine Daten'!$H$9,IF(C12=\"Sa\",'meine Daten'!$H$10,IF(C12=\"So\",'meine Daten'!$H$11))))))))","v":"08:00:00"},"",null,null,null,{"$f":"H12-G12","v":"00:00:00"},null,null,null,null,{"$f":"K12-J12+L12+M12","v":"00:00:00"},"00:00:00",null,{"$f":"IF(F12=\"Z\",-(D12),IF(G12=\"\",\" \",IF(O12+P12>D12,O12+P12-D12,IF(O12+P12<D12,-(D12-O12-P12),\" \"))))","v":" "},{"$f":"IF(ISERROR(VLOOKUP(B12,Feiertage!$B$5:$B$21,1,FALSE)),WEEKDAY(B12,2),\"Feiertag\")","v":2},{"$f":"S11+IF(F12=\"Z\",-(#REF!*24),IF(G12=\"\",0,(O12+P12-D12)*24))","v":0}]
[null,{"$f":"B12+1","v":"2023-05-03"},"Mi",{"$f":"IF(OR(E13=\"F\",F13=\"U\",F13=\"AU\"),'meine Daten'!$C$12,IF(C13=\"Mo\",'meine Daten'!$H$5,IF(C13=\"Di\",'meine Daten'!$H$6,IF(C13=\"Mi\",'meine Daten'!$H$7,IF(C13=\"Do\",'meine Daten'!$H$8,IF(C13=\"Fr\",'meine Daten'!$H$9,IF(C13=\"Sa\",'meine Daten'!$H$10,IF(C13=\"So\",'meine Daten'!$H$11))))))))","v":"08:00:00"},"",null,null,null,{"$f":"H13-G13","v":"00:00:00"},null,null,null,null,"00:00:00","00:00:00",null," ",{"$f":"IF(ISERROR(VLOOKUP(B13,Feiertage!$B$5:$B$21,1,FALSE)),WEEKDAY(B13,2),\"Feiertag\")","v":3},{"$f":"S12+IF(F13=\"Z\",-(#REF!*24),IF(G13=\"\",0,(O13+P13-D13)*24))","v":0}]
[null,"2023-05-04","Do",{"$f":"IF(OR(E14=\"F\",F14=\"U\",F14=\"AU\"),'meine Daten'!$C$12,IF(C14=\"Mo\",'meine Daten'!$H$5,IF(C14=\"Di\",'meine Daten'!$H$6,IF(C14=\"Mi\",'meine Daten'!$H$7,IF(C14=\"Do\",'meine Daten'!$H$8,IF(C14=\"Fr\",'meine Daten'!$H$9,IF(C14=\"Sa\",'meine Daten'!$H$10,IF(C14=\"So\",'meine Daten'!$H$11))))))))","v":"08:00:00"},"",null,null,null,"00:00:00",null,null,null,null,"00:00:00","00:00:00",null," ",{"$f":"IF(ISERROR(VLOOKUP(B14,Feiertage!$B$5:$B$21,1,FALSE)),WEEKDAY(B14,2),\"Feiertag\")","v":4},{"$f":"S13+IF(F14=\"Z\",-(#REF!*24),IF(G14=\"\",0,(O14+P14-D14)*24))","v":0}]
[null,"2023-05-05","Fr",{"$f":"IF(OR(E15=\"F\",F15=\"U\",F15=\"AU\"),'meine Daten'!$C$12,IF(C15=\"Mo\",'meine Daten'!$H$5,IF(C15=\"Di\",'meine Daten'!$H$6,IF(C15=\"Mi\",'meine Daten'!$H$7,IF(C15=\"Do\",'meine Daten'!$H$8,IF(C15=\"Fr\",'meine Daten'!$H$9,IF(C15=\"Sa\",'meine Daten'!$H$10,IF(C15=\"So\",'meine Daten'!$H$11))))))))","v":"08:00:00"},"",null,null,null,"00:00:00",null,null,null,null,"00:00:00","00:00:00",null," ",{"$f":"IF(ISERROR(VLOOKUP(B15,Feiertage!$B$5:$B$21,1,FALSE)),WEEKDAY(B15,2),\"Feiertag\")","v":5},{"$f":"S14+IF(F15=\"Z\",-(#REF!*24),IF(G15=\"\",0,(O15+P15-D15)*24))","v":0}]
[null,"2023-05-06","Sa",{"$f":"IF(OR(E16=\"F\",F16=\"U\",F16=\"AU\"),'meine Daten'!$C$12,IF(C16=\"Mo\",'meine Daten'!$H$5,IF(C16=\"Di\",'meine Daten'!$H$6,IF(C16=\"Mi\",'meine Daten'!$H$7,IF(C16=\"Do\",'meine Daten'!$H$8,IF(C16=\"Fr\",'meine Daten'!$H$9,IF(C16=\"Sa\",'meine Daten'!$H$10,IF(C16=\"So\",'meine Daten'!$H$11))))))))","v":"00:00:00"},"",null,null,null,"00:00:00",null,null,null,null,"00:00:00","00:00:00",null," ",{"$f":"IF(ISERROR(VLOOKUP(B16,Feiertage!$B$5:$B$21,1,FALSE)),WEEKDAY(B16,2),\"Feiertag\")","v":6},{"$f":"S15+IF(F16=\"Z\",-(#REF!*24),IF(G16=\"\",0,(O16+P16-D16)*24))","v":0}]
[null,"2023-05-07","So",{"$f":"IF(OR(E17=\"F\",F17=\"U\",F17=\"AU\"),'meine Daten'!$C$12,IF(C17=\"Mo\",'meine Daten'!$H$5,IF(C17=\"Di\",'meine Daten'!$H$6,IF(C17=\"Mi\",'meine Daten'!$H$7,IF(C17=\"Do\",'meine Daten'!$H$8,IF(C17=\"Fr\",'meine Daten'!$H$9,IF(C17=\"Sa\",'meine Daten'!$H$10,IF(C17=\"So\",'meine Daten'!$H$11))))))))","v":"00:00:00"},"",null,null,null,"00:00:00",null,null,null,null,"00:00:00","00:00:00",null," ",{"$f":"IF(ISERROR(VLOOKUP(B17,Feiertage!$B$5:$B$21,1,FALSE)),WEEKDAY(B17,2),\"Feiertag\")","v":7},{"$f":"S16+IF(F17=\"Z\",-(#REF!*24),IF(G17=\"\",0,(O17+P17-D17)*24))","v":0}]
[null,"2023-05-08","Mo",{"$f":"IF(OR(E18=\"F\",F18=\"U\",F18=\"AU\"),'meine Daten'!$C$12,IF(C18=\"Mo\",'meine Daten'!$H$5,IF(C18=\"Di\",'meine Daten'!$H$6,IF(C18=\"Mi\",'meine Daten'!$H$7,IF(C18=\"Do\",'meine Daten'!$H$8,IF(C18=\"Fr\",'meine Daten'!$H$9,IF(C18=\"Sa\",'meine Daten'!$H$10,IF(C18=\"So\",'meine Daten'!$H$11))))))))","v":"08:00:00"},"",null,null,null,"00:00:00",null,null,null,null,"00:00:00","00:00:00",null," ",{"$f":"IF(ISERROR(VLOOKUP(B18,Feiertage!$B$5:$B$21,1,FALSE)),WEEKDAY(B18,2),\"Feiertag\")","v":1},{"$f":"S17+IF(F18=\"Z\",-(#REF!*24),IF(G18=\"\",0,(O18+P18-D18)*24))","v":0}]
[null,"2023-05-09","Di",{"$f":"IF(OR(E19=\"F\",F19=\"U\",F19=\"AU\"),'meine Daten'!$C$12,IF(C19=\"Mo\",'meine Daten'!$H$5,IF(C19=\"Di\",'meine Daten'!$H$6,IF(C19=\"Mi\",'meine Daten'!$H$7,IF(C19=\"Do\",'meine Daten'!$H$8,IF(C19=\"Fr\",'meine Daten'!$H$9,IF(C19=\"Sa\",'meine Daten'!$H$10,IF(C19=\"So\",'meine Daten'!$H$11))))))))","v":"08:00:00"},"",null,null,null,"00:00:00",null,null,null,null,"00:00:00","00:00:00",null," ",{"$f":"IF(ISERROR(VLOOKUP(B19,Feiertage!$B$5:$B$21,1,FALSE)),WEEKDAY(B19,2),\"Feiertag\")","v":2},{"$f":"S18+IF(F19=\"Z\",-(#REF!*24),IF(G19=\"\",0,(O19+P19-D19)*24))","v":0}]
[null,"2023-05-10","Mi",{"$f":"IF(OR(E20=\"F\",F20=\"U\",F20=\"AU\"),'meine Daten'!$C$12,IF(C20=\"Mo\",'meine Daten'!$H$5,IF(C20=\"Di\",'meine Daten'!$H$6,IF(C20=\"Mi\",'meine Daten'!$H$7,IF(C20=\"Do\",'meine Daten'!$H$8,IF(C20=\"Fr\",'meine Daten'!$H$9,IF(C20=\"Sa\",'meine Daten'!$H$10,IF(C20=\"So\",'meine Daten'!$H$11))))))))","v":"08:00:00"},"",null,null,null,"00:00:00",null,null,null,null,"00:00:00","00:00:00",null," ",{"$f":"IF(ISERROR(VLOOKUP(B20,Feiertage!$B$5:$B$21,1,FALSE)),WEEKDAY(B20,2),\"Feiertag\")","v":3},{"$f":"S19+IF(F20=\"Z\",-(#REF!*24),IF(G20=\"\",0,(O20+P20-D20)*24))","v":0}]
[null,"2023-05-11","Do",{"$f":"IF(OR(E21=\"F\",F21=\"U\",F21=\"AU\"),'meine Daten'!$C$12,IF(C21=\"Mo\",'meine Daten'!$H$5,IF(C21=\"Di\",'meine Daten'!$H$6,IF(C21=\"Mi\",'meine Daten'!$H$7,IF(C21=\"Do\",'meine Daten'!$H$8,IF(C21=\"Fr\",'meine Daten'!$H$9,IF(C21=\"Sa\",'meine Daten'!$H$10,IF(C21=\"So\",'meine Daten'!$H$11))))))))","v":"08:00:00"},"",null,null,null,"00:00:00",null,null,null,null,"00:00:00","00:00:00",null," ",{"$f":"IF(ISERROR(VLOOKUP(B21,Feiertage!$B$5:$B$21,1,FALSE)),WEEKDAY(B21,2),\"Feiertag\")","v":4},{"$f":"S20+IF(F21=\"Z\",-(#REF!*24),IF(G21=\"\",0,(O21+P21-D21)*24))","v":0}]
[null,"2023-05-12","Fr",{"$f":"IF(OR(E22=\"F\",F22=\"U\",F22=\"AU\"),'meine Daten'!$C$12,IF(C22=\"Mo\",'meine Daten'!$H$5,IF(C22=\"Di\",'meine Daten'!$H$6,IF(C22=\"Mi\",'meine Daten'!$H$7,IF(C22=\"Do\",'meine Daten'!$H$8,IF(C22=\"Fr\",'meine Daten'!$H$9,IF(C22=\"Sa\",'meine Daten'!$H$10,IF(C22=\"So\",'meine Daten'!$H$11))))))))","v":"08:00:00"},"",null,null,null,"00:00:00",null,null,null,null,"00:00:00","00:00:00",null," ",{"$f":"IF(ISERROR(VLOOKUP(B22,Feiertage!$B$5:$B$21,1,FALSE)),WEEKDAY(B22,2),\"Feiertag\")","v":5},{"$f":"S21+IF(F22=\"Z\",-(#REF!*24),IF(G22=\"\",0,(O22+P22-D22)*24))","v":0}]
[null,"2023-05-13","Sa",{"$f":"IF(OR(E23=\"F\",F23=\"U\",F23=\"AU\"),'meine Daten'!$C$12,IF(C23=\"Mo\",'meine Daten'!$H$5,IF(C23=\"Di\",'meine Daten'!$H$6,IF(C23=\"Mi\",'meine Daten'!$H$7,IF(C23=\"Do\",'meine Daten'!$H$8,IF(C23=\"Fr\",'meine Daten'!$H$9,IF(C23=\"Sa\",'meine Daten'!$H$10,IF(C23=\"So\",'meine Daten'!$H$11))))))))","v":"00:00:00"},"",null,null,null,"00:00:00",null,null,null,null,"00:00:00","00:00:00",null," ",{"$f":"IF(ISERROR(VLOOKUP(B23,Feiertage!$B$5:$B$21,1,FALSE)),WEEKDAY(B23,2),\"Feiertag\")","v":6},{"$f":"S22+IF(F23=\"Z\",-(#REF!*24),IF(G23=\"\",0,(O23+P23-D23)*24))","v":0}]
[null,"2023-05-14","So",{"$f":"IF(OR(E24=\"F\",F24=\"U\",F24=\"AU\"),'meine Daten'!$C$12,IF(C24=\"Mo\",'meine Daten'!$H$5,IF(C24=\"Di\",'meine Daten'!$H$6,IF(C24=\"Mi\",'meine Daten'!$H$7,IF(C24=\"Do\",'meine Daten'!$H$8,IF(C24=\"Fr\",'meine Daten'!$H$9,IF(C24=\"Sa\",'meine Daten'!$H$10,IF(C24=\"So\",'meine Daten'!$H$11))))))))","v":"00:00:00"},"",null,null,null,"00:00:00",null,null,null,null,"00:00:00","00:00:00",null," ",{"$f":"IF(ISERROR(VLOOKUP(B24,Feiertage!$B$5:$B$21,1,FALSE)),WEEKDAY(B24,2),\"Feiertag\")","v":7},{"$f":"S23+IF(F24=\"Z\",-(#REF!*24),IF(G24=\"\",0,(O24+P24-D24)*24))","v":0}]
[null,"2023-05-15","Mo",{"$f":"IF(OR(E25=\"F\",F25=\"U\",F25=\"AU\"),'meine Daten'!$C$12,IF(C25=\"Mo\",'meine Daten'!$H$5,IF(C25=\"Di\",'meine Daten'!$H$6,IF(C25=\"Mi\",'meine Daten'!$H$7,IF(C25=\"Do\",'meine Daten'!$H$8,IF(C25=\"Fr\",'meine Daten'!$H$9,IF(C25=\"Sa\",'meine Daten'!$H$10,IF(C25=\"So\",'meine Daten'!$H$11))))))))","v":"08:00:00"},"",null,null,null,"00:00:00",null,null,null,null,"00:00:00","00:00:00",null," ",{"$f":"IF(ISERROR(VLOOKUP(B25,Feiertage!$B$5:$B$21,1,FALSE)),WEEKDAY(B25,2),\"Feiertag\")","v":1},{"$f":"S24+IF(F25=\"Z\",-(#REF!*24),IF(G25=\"\",0,(O25+P25-D25)*24))","v":0}]
[null,"2023-05-16","Di",{"$f":"IF(OR(E26=\"F\",F26=\"U\",F26=\"AU\"),'meine Daten'!$C$12,IF(C26=\"Mo\",'meine Daten'!$H$5,IF(C26=\"Di\",'meine Daten'!$H$6,IF(C26=\"Mi\",'meine Daten'!$H$7,IF(C26=\"Do\",'meine Daten'!$H$8,IF(C26=\"Fr\",'meine Daten'!$H$9,IF(C26=\"Sa\",'meine Daten'!$H$10,IF(C26=\"So\",'meine Daten'!$H$11))))))))","v":"08:00:00"},"",null,null,null,"00:00:00",null,null,null,null,"00:00:00","00:00:00",null," ",{"$f":"IF(ISERROR(VLOOKUP(B26,Feiertage!$B$5:$B$21,1,FALSE)),WEEKDAY(B26,2),\"Feiertag\")","v":2},{"$f":"S25+IF(F26=\"Z\",-(#REF!*24),IF(G26=\"\",0,(O26+P26-D26)*24))","v":0}]
[null,"2023-05-17","Mi",{"$f":"IF(OR(E27=\"F\",F27=\"U\",F27=\"AU\"),'meine Daten'!$C$12,IF(C27=\"Mo\",'meine Daten'!$H$5,IF(C27=\"Di\",'meine Daten'!$H$6,IF(C27=\"Mi\",'meine Daten'!$H$7,IF(C27=\"Do\",'meine Daten'!$H$8,IF(C27=\"Fr\",'meine Daten'!$H$9,IF(C27=\"Sa\",'meine Daten'!$H$10,IF(C27=\"So\",'meine Daten'!$H$11))))))))","v":"08:00:00"},"",null,null,null,"00:00:00",null,null,null,null,"00:00:00","00:00:00",null," ",{"$f":"IF(ISERROR(VLOOKUP(B27,Feiertage!$B$5:$B$21,1,FALSE)),WEEKDAY(B27,2),\"Feiertag\")","v":3},{"$f":"S26+IF(F27=\"Z\",-(#REF!*24),IF(G27=\"\",0,(O27+P27-D27)*24))","v":0}]
[null,"2023-05-18","Do",{"$f":"IF(OR(E28=\"F\",F28=\"U\",F28=\"AU\"),'meine Daten'!$C$12,IF(C28=\"Mo\",'meine Daten'!$H$5,IF(C28=\"Di\",'meine Daten'!$H$6,IF(C28=\"Mi\",'meine Daten'!$H$7,IF(C28=\"Do\",'meine Daten'!$H$8,IF(C28=\"Fr\",'meine Daten'!$H$9,IF(C28=\"Sa\",'meine Daten'!$H$10,IF(C28=\"So\",'meine Daten'!$H$11))))))))","v":"00:00:00"},"F",null,null,null,"00:00:00",null,null,null,null,"00:00:00","00:00:00",null," ",{"$f":"IF(ISERROR(VLOOKUP(B28,Feiertage!$B$5:$B$21,1,FALSE)),WEEKDAY(B28,2),\"Feiertag\")","v":"Feiertag"},{"$f":"S27+IF(F28=\"Z\",-(#REF!*24),IF(G28=\"\",0,(O28+P28-D28)*24))","v":0}]
[null,"2023-05-19","Fr",{"$f":"IF(OR(E29=\"F\",F29=\"U\",F29=\"AU\"),'meine Daten'!$C$12,IF(C29=\"Mo\",'meine Daten'!$H$5,IF(C29=\"Di\",'meine Daten'!$H$6,IF(C29=\"Mi\",'meine Daten'!$H$7,IF(C29=\"Do\",'meine Daten'!$H$8,IF(C29=\"Fr\",'meine Daten'!$H$9,IF(C29=\"Sa\",'meine Daten'!$H$10,IF(C29=\"So\",'meine Daten'!$H$11))))))))","v":"08:00:00"},"",null,null,null,"00:00:00",null,null,null,null,"00:00:00","00:00:00",null," ",{"$f":"IF(ISERROR(VLOOKUP(B29,Feiertage!$B$5:$B$21,1,FALSE)),WEEKDAY(B29,2),\"Feiertag\")","v":5},{"$f":"S28+IF(F29=\"Z\",-(#REF!*24),IF(G29=\"\",0,(O29+P29-D29)*24))","v":0}]
[null,"2023-05-20","Sa",{"$f":"IF(OR(E30=\"F\",F30=\"U\",F30=\"AU\"),'meine Daten'!$C$12,IF(C30=\"Mo\",'meine Daten'!$H$5,IF(C30=\"Di\",'meine Daten'!$H$6,IF(C30=\"Mi\",'meine Daten'!$H$7,IF(C30=\"Do\",'meine Daten'!$H$8,IF(C30=\"Fr\",'meine Daten'!$H$9,IF(C30=\"Sa\",'meine Daten'!$H$10,IF(C30=\"So\",'meine Daten'!$H$11))))))))","v":"00:00:00"},"",null,null,null,"00:00:00",null,null,null,null,"00:00:00","00:00:00",null," ",{"$f":"IF(ISERROR(VLOOKUP(B30,Feiertage!$B$5:$B$21,1,FALSE)),WEEKDAY(B30,2),\"Feiertag\")","v":6},{"$f":"S29+IF(F30=\"Z\",-(#REF!*24),IF(G30=\"\",0,(O30+P30-D30)*24))","v":0}]
[null,"2023-05-21","So",{"$f":"IF(OR(E31=\"F\",F31=\"U\",F31=\"AU\"),'meine Daten'!$C$12,IF(C31=\"Mo\",'meine Daten'!$H$5,IF(C31=\"Di\",'meine Daten'!$H$6,IF(C31=\"Mi\",'meine Daten'!$H$7,IF(C31=\"Do\",'meine Daten'!$H$8,IF(C31=\"Fr\",'meine Daten'!$H$9,IF(C31=\"Sa\",'meine Daten'!$H$10,IF(C31=\"So\",'meine Daten'!$H$11))))))))","v":"00:00:00"},"",null,null,null,"00:00:00",null,null,null,null,"00:00:00","00:00:00",null," ",{"$f":"IF(ISERROR(VLOOKUP(B31,Feiertage!$B$5:$B$21,1,FALSE)),WEEKDAY(B31,2),\"Feiertag\")","v":7},{"$f":"S30+IF(F31=\"Z\",-(#REF!*24),IF(G31=\"\",0,(O31+P31-D31)*24))","v":0}]
[null,"2023-05-22","Mo",{"$f":"IF(OR(E32=\"F\",F32=\"U\",F32=\"AU\"),'meine Daten'!$C$12,IF(C32=\"Mo\",'meine Daten'!$H$5,IF(C32=\"Di\",'meine Daten'!$H$6,IF(C32=\"Mi\",'meine Daten'!$H$7,IF(C32=\"Do\",'meine Daten'!$H$8,IF(C32=\"Fr\",'meine Daten'!$H$9,IF(C32=\"Sa\",'meine Daten'!$H$10,IF(C32=\"So\",'meine Daten'!$H$11))))))))","v":"08:00:00"},"",null,null,null,"00:00:00",null,null,null,null,"00:00:00","00:00:00",null," ",{"$f":"IF(ISERROR(VLOOKUP(B32,Feiertage!$B$5:$B$21,1,FALSE)),WEEKDAY(B32,2),\"Feiertag\")","v":1},{"$f":"S31+IF(F32=\"Z\",-(#REF!*24),IF(G32=\"\",0,(O32+P32-D32)*24))","v":0}]
[null,"2023-05-23","Di",{"$f":"IF(OR(E33=\"F\",F33=\"U\",F33=\"AU\"),'meine Daten'!$C$12,IF(C33=\"Mo\",'meine Daten'!$H$5,IF(C33=\"Di\",'meine Daten'!$H$6,IF(C33=\"Mi\",'meine Daten'!$H$7,IF(C33=\"Do\",'meine Daten'!$H$8,IF(C33=\"Fr\",'meine Daten'!$H$9,IF(C33=\"Sa\",'meine Daten'!$H$10,IF(C33=\"So\",'meine Daten'!$H$11))))))))","v":"08:00:00"},"",null,null,null,"00:00:00",null,null,null,null,"00:00:00","00:00:00",null," ",{"$f":"IF(ISERROR(VLOOKUP(B33,Feiertage!$B$5:$B$21,1,FALSE)),WEEKDAY(B33,2),\"Feiertag\")","v":2},{"$f":"S32+IF(F33=\"Z\",-(#REF!*24),IF(G33=\"\",0,(O33+P33-D33)*24))","v":0}]
[null,"2023-05-24","Mi",{"$f":"IF(OR(E34=\"F\",F34=\"U\",F34=\"AU\"),'meine Daten'!$C$12,IF(C34=\"Mo\",'meine Daten'!$H$5,IF(C34=\"Di\",'meine Daten'!$H$6,IF(C34=\"Mi\",'meine Daten'!$H$7,IF(C34=\"Do\",'meine Daten'!$H$8,IF(C34=\"Fr\",'meine Daten'!$H$9,IF(C34=\"Sa\",'meine Daten'!$H$10,IF(C34=\"So\",'meine Daten'!$H$11))))))))","v":"08:00:00"},"",null,null,null,"00:00:00",null,null,null,null,"00:00:00","00:00:00",null," ",{"$f":"IF(ISERROR(VLOOKUP(B34,Feiertage!$B$5:$B$21,1,FALSE)),WEEKDAY(B34,2),\"Feiertag\")","v":3},{"$f":"S33+IF(F34=\"Z\",-(#REF!*24),IF(G34=\"\",0,(O34+P34-D34)*24))","v":0}]
[null,"2023-05-25","Do",{"$f":"IF(OR(E35=\"F\",F35=\"U\",F35=\"AU\"),'meine Daten'!$C$12,IF(C35=\"Mo\",'meine Daten'!$H$5,IF(C35=\"Di\",'meine Daten'!$H$6,IF(C35=\"Mi\",'meine Daten'!$H$7,IF(C35=\"Do\",'meine Daten'!$H$8,IF(C35=\"Fr\",'meine Daten'!$H$9,IF(C35=\"Sa\",'meine Daten'!$H$10,IF(C35=\"So\",'meine Daten'!$H$11))))))))","v":"08:00:00"},"",null,null,null,"00:00:00",null,null,null,null,"00:00:00","00:00:00",null," ",{"$f":"IF(ISERROR(VLOOKUP(B35,Feiertage!$B$5:$B$21,1,FALSE)),WEEKDAY(B35,2),\"Feiertag\")","v":4},{"$f":"S34+IF(F35=\"Z\",-(#REF!*24),IF(G35=\"\",0,(O35+P35-D35)*24))","v":0}]
[null,"2023-05-26","Fr",{"$f":"IF(OR(E36=\"F\",F36=\"U\",F36=\"AU\"),'meine Daten'!$C$12,IF(C36=\"Mo\",'meine Daten'!$H$5,IF(C36=\"Di\",'meine Daten'!$H$6,IF(C36=\"Mi\",'meine Daten'!$H$7,IF(C36=\"Do\",'meine Daten'!$H$8,IF(C36=\"Fr\",'meine Daten'!$H$9,IF(C36=\"Sa\",'meine Daten'!$H$10,IF(C36=\"So\",'meine Daten'!$H$11))))))))","v":"08:00:00"},"",null,null,null,"00:00:00",null,null,null,null,"00:00:00","00:00:00",null," ",{"$f":"IF(ISERROR(VLOOKUP(B36,Feiertage!$B$5:$B$21,1,FALSE)),WEEKDAY(B36,2),\"Feiertag\")","v":5},{"$f":"S35+IF(F36=\"Z\",-(#REF!*24),IF(G36=\"\",0,(O36+P36-D36)*24))","v":0}]
[null,"2023-05-27","Sa",{"$f":"IF(OR(E37=\"F\",F37=\"U\",F37=\"AU\"),'meine Daten'!$C$12,IF(C37=\"Mo\",'meine Daten'!$H$5,IF(C37=\"Di\",'meine Daten'!$H$6,IF(C37=\"Mi\",'meine Daten'!$H$7,IF(C37=\"Do\",'meine Daten'!$H$8,IF(C37=\"Fr\",'meine Daten'!$H$9,IF(C37=\"Sa\",'meine Daten'!$H$10,IF(C37=\"So\",'meine Daten'!$H$11))))))))","v":"00:00:00"},"",null,null,null,"00:00:00",null,null,null,null,"00:00:00","00:00:00",null," ",{"$f":"IF(ISERROR(VLOOKUP(B37,Feiertage!$B$5:$B$21,1,FALSE)),WEEKDAY(B37,2),\"Feiertag\")","v":6},{"$f":"S36+IF(F37=\"Z\",-(#REF!*24),IF(G37=\"\",0,(O37+P37-D37)*24))","v":0}]
[null,"2023-05-28","So",{"$f":"IF(OR(E38=\"F\",F38=\"U\",F38=\"AU\"),'meine Daten'!$C$12,IF(C38=\"Mo\",'meine Daten'!$H$5,IF(C38=\"Di\",'meine Daten'!$H$6,IF(C38=\"Mi\",'meine Daten'!$H$7,IF(C38=\"Do\",'meine Daten'!$H$8,IF(C38=\"Fr\",'meine Daten'!$H$9,IF(C38=\"Sa\",'meine Daten'!$H$10,IF(C38=\"So\",'meine Daten'!$H$11))))))))","v":"00:00:00"},"",null,null,null,"00:00:00",null,null,null,null,"00:00:00","00:00:00",null," ",{"$f":"IF(ISERROR(VLOOKUP(B38,Feiertage!$B$5:$B$21,1,FALSE)),WEEKDAY(B38,2),\"Feiertag\")","v":7},{"$f":"S37+IF(F38=\"Z\",-(#REF!*24),IF(G38=\"\",0,(O38+P38-D38)*24))","v":0},null,null,"Ich versichere die Richtigkeit meiner Angaben. Mir ist bekannt, "]
[null,"2023-05-29","Mo",{"$f":"IF(OR(E39=\"F\",F39=\"U\",F39=\"AU\"),'meine Daten'!$C$12,IF(C39=\"Mo\",'meine Daten'!$H$5,IF(C39=\"Di\",'meine Daten'!$H$6,IF(C39=\"Mi\",'meine Daten'!$H$7,IF(C39=\"Do\",'meine Daten'!$H$8,IF(C39=\"Fr\",'meine Daten'!$H$9,IF(C39=\"Sa\",'meine Daten'!$H$10,IF(C39=\"So\",'meine Daten'!$H$11))))))))","v":"00:00:00"},"F",null,null,null,"00:00:00",null,null,null,null,"00:00:00","00:00:00",null," ",{"$f":"IF(ISERROR(VLOOKUP(B39,Feiertage!$B$5:$B$21,1,FALSE)),WEEKDAY(B39,2),\"Feiertag\")","v":"Feiertag"},{"$f":"S38+IF(F39=\"Z\",-(#REF!*24),IF(G39=\"\",0,(O39+P39-D39)*24))","v":0},null,null,"dass unrichtige Angaben eine grobe Pflichtverletzung darstellen. "]
[null,"2023-05-30","Di",{"$f":"IF(OR(E40=\"F\",F40=\"U\",F40=\"AU\"),'meine Daten'!$C$12,IF(C40=\"Mo\",'meine Daten'!$H$5,IF(C40=\"Di\",'meine Daten'!$H$6,IF(C40=\"Mi\",'meine Daten'!$H$7,IF(C40=\"Do\",'meine Daten'!$H$8,IF(C40=\"Fr\",'meine Daten'!$H$9,IF(C40=\"Sa\",'meine Daten'!$H$10,IF(C40=\"So\",'meine Daten'!$H$11))))))))","v":"08:00:00"},"",null,null,null,"00:00:00",null,null,null,null,"00:00:00","00:00:00",null," ",{"$f":"IF(ISERROR(VLOOKUP(B40,Feiertage!$B$5:$B$21,1,FALSE)),WEEKDAY(B40,2),\"Feiertag\")","v":2},{"$f":"S39+IF(F40=\"Z\",-(#REF!*24),IF(G40=\"\",0,(O40+P40-D40)*24))","v":0}]
[null,"2023-05-31","Mi",{"$f":"IF(OR(E41=\"F\",F41=\"U\",F41=\"AU\"),'meine Daten'!$C$12,IF(C41=\"Mo\",'meine Daten'!$H$5,IF(C41=\"Di\",'meine Daten'!$H$6,IF(C41=\"Mi\",'meine Daten'!$H$7,IF(C41=\"Do\",'meine Daten'!$H$8,IF(C41=\"Fr\",'meine Daten'!$H$9,IF(C41=\"Sa\",'meine Daten'!$H$10,IF(C41=\"So\",'meine Daten'!$H$11))))))))","v":"08:00:00"},"",null,null,null,"00:00:00",null,null,null,null,"00:00:00","00:00:00",null," ",{"$f":"IF(ISERROR(VLOOKUP(B41,Feiertage!$B$5:$B$21,1,FALSE)),WEEKDAY(B41,2),\"Feiertag\")","v":3},{"$f":"S40+IF(F41=\"Z\",-(#REF!*24),IF(G41=\"\",0,(O41+P41-D41)*24))","v":0}]
[null,null,null,null,null,{"$f":"COUNTIF(F13:F41,\"U\")+COUNTIF(F13:F41,\"Z\")+COUNTIF(F13:F41,AU)","v":0},{"$f":"IF(SUM(G13:G41)<=0,0,1)","v":0},null,null,null,null,null,null,null,null,null,{"$f":"SUM(Q11:Q41)","v":0}]
[null,null,null,null,null,null,null,null,null,null,null,null,null,"Monatssaldo:",null,null,{"$f":"IF(F42+G42=0,\"\",SUM(Q11:Q41))","v":""}]
[null,null,null,null,null,null,null,null,null,null,null,null,null,"Gleitzeitkontostand:",null,null,{"$f":"IF(OR(Q10=\"\",Q43=\"\"),\"\",Q10+Q43)","v":""},null,null,null,null,"Datum, Unterschrift"]
[null,null,null,null,null,null,null,null,null,null,null,null,null,"(In Stunden:Minuten)"]
[null,null,null,null,null,null,null,null,null,null,null,null,null,null,null,null,null,null,null,null,null,null,"„Der Arbeitszeit-Checker“ von Simone Back für www.arbeitszeit-klug-gestalten.de "]
[null,null,null,null,null,null,null,null,null,null,null,null,null,"Urlaubstage",null,null,{"$f":"COUNTIF(F11:F41,\"U\")","v":0}]
[null,null,null,null,null,null,null,null,null,null,null,null,null,null,null,null,null,null,null,null,null,null,"ist lizensiert unter einer Creative Commons Lizenz CC BY SA 4.0 \n(Nutzung bei Namensnennung, Weitergabe unter gleichen Bedingungen)"]
[null,null,null,null,null,null,null,null,null,null,null,null,null,null,null,null,null,null,null,null,null,"Copyright für das Logo \"Arbeitszeit klug gestalten\": RKW Hessen. Das Logo darf nur für den Checker in der Ursprungsform genutzt werden."]

{"sheet":"Juni","index":7,"n_rows":49,"n_cols":29,"rows_kept":49,"cut":false,"hidden":false,"merged":[[3,15,3,16],[6,1,8,1],[6,2,8,2],[6,3,8,3],[6,4,8,4],[6,5,8,5],[6,15,7,15],[7,9,7,10],[7,11,7,12],[45,22,46,25],[48,28,49,31],[9,1,9,15],[46,1,46,2],[47,22,47,25],[48,21,48,25]]}
[null,"Arbeitszeit-Nachweis",null,null,null,null,null,"Name:",null,{"$f":"IF('meine Daten'!C3=\"\",\"\",'meine Daten'!C3)","v":""},null,null,null,null,null,null,null,null,{"$f":"B11","v":"2023-06-01"},{"$f":"B11","v":"2023-06-01"}]
[]
[null,null,null,null,"Symbol* :  ","U","=Urlaub"]
[null,null,null,null,null,"AU","=Krank/Kur",null,null,null,null,null,null,null,"bedeutet:","Eintrag fehlt "]
[null,null,null,null,null,"Z","Zeitausgleich (ganzer Tag)",null,null,null,null,null,null,null,"bedeutet:","mehr als 10 Stunden"]
[]
[null,"Datum","Tag","Sollzeit","Feiertag","Symbol *","Brutto-Arbeitszeit",null,null,"Pausen",null,null,null,null,"Netto","weitere\nReisezeit","Saldo"]
[null,null,null,null,null,null,null,null,null,"Mittag",null,"weitere\n(Std:Min)",null,"Summe","Arbeits-\nzeit",null,"Arbeits-\nzeit"]
[null,null,null,null,null,null,"von","bis","Std:Min","von","bis","I","II","./.Std:Min","Std:Min","Std:Min","Std:Min",null,null,"Bemerkung"]
[null,"Übertrag vom Vormonat: ",null,null,null,null,null,null,null,null,null,null,null,null,null,null,{"$f":"Mai!Q44","v":""}]
[null,{"$f":"Mai!B41+1","v":"2023-06-01"},{"$f":"TEXT(B11,\"TTT\")","v":"Do"},{"$f":"IF(OR(E11=\"F\",F11=\"U\",F11=\"AU\"),'meine Daten'!$C$12,IF(C11=\"Mo\",'meine Daten'!$H$13,IF(C11=\"Di\",'meine Daten'!$H$14,IF(C11=\"Mi\",'meine Daten'!$H$15,IF(C11=\"Do\",'meine Daten'!$H$16,IF(C11=\"Fr\",'meine Daten'!$H$17,IF(C11=\"Sa\",'meine Daten'!$H$18,IF(C11=\"So\",'meine Daten'!$H$19))))))))","v":"08:00:00"},{"$f":"IF(R11=\"Feiertag\",\"F\",\"\")","v":""},null,null,null,{"$f":"H11-G11","v":"00:00:00"},null,null,null,null,{"$f":"K11-J11+L11+M11","v":"00:00:00"},{"$f":"I11-N11","v":"00:00:00"},null,{"$f":"IF(F11=\"Z\",-(D11),IF(G11=\"\",\" \",IF(O11+P11>D11,O11+P11-D11,IF(O11+P11<D11,-(D11-O11-P11),\" \"))))","v":" "},{"$f":"IF(ISERROR(VLOOKUP(B11,Feiertage!$B$5:$B$21,1,FALSE)),WEEKDAY(B11,2),\"Feiertag\")","v":4},{"$f":"IF(G11=\"\",0,(O11+P11-D11)*24)","v":0}]
[null,{"$f":"B11+1","v":"2023-06-02"},{"$f":"TEXT(B12,\"TTT\")","v":"Fr"},{"$f":"IF(OR(E12=\"F\",F12=\"U\",F12=\"AU\"),'meine Daten'!$C$12,IF(C12=\"Mo\",'meine Daten'!$H$13,IF(C12=\"Di\",'meine Daten'!$H$14,IF(C12=\"Mi\",'meine Daten'!$H$15,IF(C12=\"Do\",'meine Daten'!$H$16,IF(C12=\"Fr\",'meine Daten'!$H$17,IF(C12=\"Sa\",'meine Daten'!$H$18,IF(C12=\"So\",'meine Daten'!$H$19))))))))","v":"08:00:00"},"",null,null,null,{"$f":"H12-G12","v":"00:00:00"},null,null,null,null,{"$f":"K12-J12+L12+M12","v":"00:00:00"},"00:00:00",null,{"$f":"IF(F12=\"Z\",-(D12),IF(G12=\"\",\" \",IF(O12+P12>D12,O12+P12-D12,IF(O12+P12<D12,-(D12-O12-P12),\" \"))))","v":" "},{"$f":"IF(ISERROR(VLOOKUP(B12,Feiertage!$B$5:$B$21,1,FALSE)),WEEKDAY(B12,2),\"Feiertag\")","v":5},{"$f":"S11+IF(F12=\"Z\",-(#REF!*24),IF(G12=\"\",0,(O12+P12-D12)*24))","v":0}]
[null,{"$f":"B12+1","v":"2023-06-03"},"Sa",{"$f":"IF(OR(E13=\"F\",F13=\"U\",F13=\"AU\"),'meine Daten'!$C$12,IF(C13=\"Mo\",'meine Daten'!$H$13,IF(C13=\"Di\",'meine Daten'!$H$14,IF(C13=\"Mi\",'meine Daten'!$H$15,IF(C13=\"Do\",'meine Daten'!$H$16,IF(C13=\"Fr\",'meine Daten'!$H$17,IF(C13=\"Sa\",'meine Daten'!$H$18,IF(C13=\"So\",'meine Daten'!$H$19))))))))","v":"00:00:00"},"",null,null,null,{"$f":"H13-G13","v":"00:00:00"},null,null,null,null,"00:00:00","00:00:00",null," ",{"$f":"IF(ISERROR(VLOOKUP(B13,Feiertage!$B$5:$B$21,1,FALSE)),WEEKDAY(B13,2),\"Feiertag\")","v":6},{"$f":"S12+IF(F13=\"Z\",-(#REF!*24),IF(G13=\"\",0,(O13+P13-D13)*24))","v":0}]
[null,{"$f":"B13+1","v":"2023-06-04"},"So",{"$f":"IF(OR(E14=\"F\",F14=\"U\",F14=\"AU\"),'meine Daten'!$C$12,IF(C14=\"Mo\",'meine Daten'!$H$13,IF(C14=\"Di\",'meine Daten'!$H$14,IF(C14=\"Mi\",'meine Daten'!$H$15,IF(C14=\"Do\",'meine Daten'!$H$16,IF(C14=\"Fr\",'meine Daten'!$H$17,IF(C14=\"Sa\",'meine Daten'!$H$18,IF(C14=\"So\",'meine Daten'!$H$19))))))))","v":"00:00:00"},"",null,null,null,"00:00:00",null,null,null,null,"00:00:00","00:00:00",null," ",{"$f":"IF(ISERROR(VLOOKUP(B14,Feiertage!$B$5:$B$21,1,FALSE)),WEEKDAY(B14,2),\"Feiertag\")","v":7},{"$f":"S13+IF(F14=\"Z\",-(#REF!*24),IF(G14=\"\",0,(O14+P14-D14)*24))","v":0}]
[null,"2023-06-05","Mo",{"$f":"IF(OR(E15=\"F\",F15=\"U\",F15=\"AU\"),'meine Daten'!$C$12,IF(C15=\"Mo\",'meine Daten'!$H$13,IF(C15=\"Di\",'meine Daten'!$H$14,IF(C15=\"Mi\",'meine Daten'!$H$15,IF(C15=\"Do\",'meine Daten'!$H$16,IF(C15=\"Fr\",'meine Daten'!$H$17,IF(C15=\"Sa\",'meine Daten'!$H$18,IF(C15=\"So\",'meine Daten'!$H$19))))))))","v":"08:00:00"},"",null,null,null,"00:00:00",null,null,null,null,"00:00:00","00:00:00",null," ",{"$f":"IF(ISERROR(VLOOKUP(B15,Feiertage!$B$5:$B$21,1,FALSE)),WEEKDAY(B15,2),\"Feiertag\")","v":1},{"$f":"S14+IF(F15=\"Z\",-(#REF!*24),IF(G15=\"\",0,(O15+P15-D15)*24))","v":0}]
[null,"2023-06-06","Di",{"$f":"IF(OR(E16=\"F\",F16=\"U\",F16=\"AU\"),'meine Daten'!$C$12,IF(C16=\"Mo\",'meine Daten'!$H$13,IF(C16=\"Di\",'meine Daten'!$H$14,IF(C16=\"Mi\",'meine Daten'!$H$15,IF(C16=\"Do\",'meine Daten'!$H$16,IF(C16=\"Fr\",'meine Daten'!$H$17,IF(C16=\"Sa\",'meine Daten'!$H$18,IF(C16=\"So\",'meine Daten'!$H$19))))))))","v":"08:00:00"},"",null,null,null,"00:00:00",null,null,null,null,"00:00:00","00:00:00",null," ",{"$f":"IF(ISERROR(VLOOKUP(B16,Feiertage!$B$5:$B$21,1,FALSE)),WEEKDAY(B16,2),\"Feiertag\")","v":2},{"$f":"S15+IF(F16=\"Z\",-(#REF!*24),IF(G16=\"\",0,(O16+P16-D16)*24))","v":0}]
[null,"2023-06-07","Mi",{"$f":"IF(OR(E17=\"F\",F17=\"U\",F17=\"AU\"),'meine Daten'!$C$12,IF(C17=\"Mo\",'meine Daten'!$H$13,IF(C17=\"Di\",'meine Daten'!$H$14,IF(C17=\"Mi\",'meine Daten'!$H$15,IF(C17=\"Do\",'meine Daten'!$H$16,IF(C17=\"Fr\",'meine Daten'!$H$17,IF(C17=\"Sa\",'meine Daten'!$H$18,IF(C17=\"So\",'meine Daten'!$H$19))))))))","v":"08:00:00"},"",null,null,null,"00:00:00",null,null,null,null,"00:00:00","00:00:00",null," ",{"$f":"IF(ISERROR(VLOOKUP(B17,Feiertage!$B$5:$B$21,1,FALSE)),WEEKDAY(B17,2),\"Feiertag\")","v":3},{"$f":"S16+IF(F17=\"Z\",-(#REF!*24),IF(G17=\"\",0,(O17+P17-D17)*24))","v":0}]
[null,"2023-06-08","Do",{"$f":"IF(OR(E18=\"F\",F18=\"U\",F18=\"AU\"),'meine Daten'!$C$12,IF(C18=\"Mo\",'meine Daten'!$H$13,IF(C18=\"Di\",'meine Daten'!$H$14,IF(C18=\"Mi\",'meine Daten'!$H$15,IF(C18=\"Do\",'meine Daten'!$H$16,IF(C18=\"Fr\",'meine Daten'!$H$17,IF(C18=\"Sa\",'meine Daten'!$H$18,IF(C18=\"So\",'meine Daten'!$H$19))))))))","v":"00:00:00"},"F",null,null,null,"00:00:00",null,null,null,null,"00:00:00","00:00:00",null," ",{"$f":"IF(ISERROR(VLOOKUP(B18,Feiertage!$B$5:$B$21,1,FALSE)),WEEKDAY(B18,2),\"Feiertag\")","v":"Feiertag"},{"$f":"S17+IF(F18=\"Z\",-(#REF!*24),IF(G18=\"\",0,(O18+P18-D18)*24))","v":0}]
[null,"2023-06-09","Fr",{"$f":"IF(OR(E19=\"F\",F19=\"U\",F19=\"AU\"),'meine Daten'!$C$12,IF(C19=\"Mo\",'meine Daten'!$H$13,IF(C19=\"Di\",'meine Daten'!$H$14,IF(C19=\"Mi\",'meine Daten'!$H$15,IF(C19=\"Do\",'meine Daten'!$H$16,IF(C19=\"Fr\",'meine Daten'!$H$17,IF(C19=\"Sa\",'meine Daten'!$H$18,IF(C19=\"So\",'meine Daten'!$H$19))))))))","v":"08:00:00"},"",null,null,null,"00:00:00",null,null,null,null,"00:00:00","00:00:00",null," ",{"$f":"IF(ISERROR(VLOOKUP(B19,Feiertage!$B$5:$B$21,1,FALSE)),WEEKDAY(B19,2),\"Feiertag\")","v":5},{"$f":"S18+IF(F19=\"Z\",-(#REF!*24),IF(G19=\"\",0,(O19+P19-D19)*24))","v":0}]
[null,"2023-06-10","Sa",{"$f":"IF(OR(E20=\"F\",F20=\"U\",F20=\"AU\"),'meine Daten'!$C$12,IF(C20=\"Mo\",'meine Daten'!$H$13,IF(C20=\"Di\",'meine Daten'!$H$14,IF(C20=\"Mi\",'meine Daten'!$H$15,IF(C20=\"Do\",'meine Daten'!$H$16,IF(C20=\"Fr\",'meine Daten'!$H$17,IF(C20=\"Sa\",'meine Daten'!$H$18,IF(C20=\"So\",'meine Daten'!$H$19))))))))","v":"00:00:00"},"",null,null,null,"00:00:00",null,null,null,null,"00:00:00","00:00:00",null," ",{"$f":"IF(ISERROR(VLOOKUP(B20,Feiertage!$B$5:$B$21,1,FALSE)),WEEKDAY(B20,2),\"Feiertag\")","v":6},{"$f":"S19+IF(F20=\"Z\",-(#REF!*24),IF(G20=\"\",0,(O20+P20-D20)*24))","v":0}]
[null,"2023-06-11","So",{"$f":"IF(OR(E21=\"F\",F21=\"U\",F21=\"AU\"),'meine Daten'!$C$12,IF(C21=\"Mo\",'meine Daten'!$H$13,IF(C21=\"Di\",'meine Daten'!$H$14,IF(C21=\"Mi\",'meine Daten'!$H$15,IF(C21=\"Do\",'meine Daten'!$H$16,IF(C21=\"Fr\",'meine Daten'!$H$17,IF(C21=\"Sa\",'meine Daten'!$H$18,IF(C21=\"So\",'meine Daten'!$H$19))))))))","v":"00:00:00"},"",null,null,null,"00:00:00",null,null,null,null,"00:00:00","00:00:00",null," ",{"$f":"IF(ISERROR(VLOOKUP(B21,Feiertage!$B$5:$B$21,1,FALSE)),WEEKDAY(B21,2),\"Feiertag\")","v":7},{"$f":"S20+IF(F21=\"Z\",-(#REF!*24),IF(G21=\"\",0,(O21+P21-D21)*24))","v":0}]
[null,"2023-06-12","Mo",{"$f":"IF(OR(E22=\"F\",F22=\"U\",F22=\"AU\"),'meine Daten'!$C$12,IF(C22=\"Mo\",'meine Daten'!$H$13,IF(C22=\"Di\",'meine Daten'!$H$14,IF(C22=\"Mi\",'meine Daten'!$H$15,IF(C22=\"Do\",'meine Daten'!$H$16,IF(C22=\"Fr\",'meine Daten'!$H$17,IF(C22=\"Sa\",'meine Daten'!$H$18,IF(C22=\"So\",'meine Daten'!$H$19))))))))","v":"08:00:00"},"",null,null,null,"00:00:00",null,null,null,null,"00:00:00","00:00:00",null," ",{"$f":"IF(ISERROR(VLOOKUP(B22,Feiertage!$B$5:$B$21,1,FALSE)),WEEKDAY(B22,2),\"Feiertag\")","v":1},{"$f":"S21+IF(F22=\"Z\",-(#REF!*24),IF(G22=\"\",0,(O22+P22-D22)*24))","v":0}]
[null,"2023-06-13","Di",{"$f":"IF(OR(E23=\"F\",F23=\"U\",F23=\"AU\"),'meine Daten'!$C$12,IF(C23=\"Mo\",'meine Daten'!$H$13,IF(C23=\"Di\",'meine Daten'!$H$14,IF(C23=\"Mi\",'meine Daten'!$H$15,IF(C23=\"Do\",'meine Daten'!$H$16,IF(C23=\"Fr\",'meine Daten'!$H$17,IF(C23=\"Sa\",'meine Daten'!$H$18,IF(C23=\"So\",'meine Daten'!$H$19))))))))","v":"08:00:00"},"",null,null,null,"00:00:00",null,null,null,null,"00:00:00","00:00:00",null," ",{"$f":"IF(ISERROR(VLOOKUP(B23,Feiertage!$B$5:$B$21,1,FALSE)),WEEKDAY(B23,2),\"Feiertag\")","v":2},{"$f":"S22+IF(F23=\"Z\",-(#REF!*24),IF(G23=\"\",0,(O23+P23-D23)*24))","v":0}]
[null,"2023-06-14","Mi",{"$f":"IF(OR(E24=\"F\",F24=\"U\",F24=\"AU\"),'meine Daten'!$C$12,IF(C24=\"Mo\",'meine Daten'!$H$13,IF(C24=\"Di\",'meine Daten'!$H$14,IF(C24=\"Mi\",'meine Daten'!$H$15,IF(C24=\"Do\",'meine Daten'!$H$16,IF(C24=\"Fr\",'meine Daten'!$H$17,IF(C24=\"Sa\",'meine Daten'!$H$18,IF(C24=\"So\",'meine Daten'!$H$19))))))))","v":"08:00:00"},"",null,null,null,"00:00:00",null,null,null,null,"00:00:00","00:00:00",null," ",{"$f":"IF(ISERROR(VLOOKUP(B24,Feiertage!$B$5:$B$21,1,FALSE)),WEEKDAY(B24,2),\"Feiertag\")","v":3},{"$f":"S23+IF(F24=\"Z\",-(#REF!*24),IF(G24=\"\",0,(O24+P24-D24)*24))","v":0}]
[null,"2023-06-15","Do",{"$f":"IF(OR(E25=\"F\",F25=\"U\",F25=\"AU\"),'meine Daten'!$C$12,IF(C25=\"Mo\",'meine Daten'!$H$13,IF(C25=\"Di\",'meine Daten'!$H$14,IF(C25=\"Mi\",'meine Daten'!$H$15,IF(C25=\"Do\",'meine Daten'!$H$16,IF(C25=\"Fr\",'meine Daten'!$H$17,IF(C25=\"Sa\",'meine Daten'!$H$18,IF(C25=\"So\",'meine Daten'!$H$19))))))))","v":"08:00:00"},"",null,null,null,"00:00:00",null,null,null,null,"00:00:00","00:00:00",null," ",{"$f":"IF(ISERROR(VLOOKUP(B25,Feiertage!$B$5:$B$21,1,FALSE)),WEEKDAY(B25,2),\"Feiertag\")","v":4},{"$f":"S24+IF(F25=\"Z\",-(#REF!*24),IF(G25=\"\",0,(O25+P25-D25)*24))","v":0}]
[null,"2023-06-16","Fr",{"$f":"IF(OR(E26=\"F\",F26=\"U\",F26=\"AU\"),'meine Daten'!$C$12,IF(C26=\"Mo\",'meine Daten'!$H$13,IF(C26=\"Di\",'meine Daten'!$H$14,IF(C26=\"Mi\",'meine Daten'!$H$15,IF(C26=\"Do\",'meine Daten'!$H$16,IF(C26=\"Fr\",'meine Daten'!$H$17,IF(C26=\"Sa\",'meine Daten'!$H$18,IF(C26=\"So\",'meine Daten'!$H$19))))))))","v":"08:00:00"},"",null,null,null,"00:00:00",null,null,null,null,"00:00:00","00:00:00",null," ",{"$f":"IF(ISERROR(VLOOKUP(B26,Feiertage!$B$5:$B$21,1,FALSE)),WEEKDAY(B26,2),\"Feiertag\")","v":5},{"$f":"S25+IF(F26=\"Z\",-(#REF!*24),IF(G26=\"\",0,(O26+P26-D26)*24))","v":0}]
[null,"2023-06-17","Sa",{"$f":"IF(OR(E27=\"F\",F27=\"U\",F27=\"AU\"),'meine Daten'!$C$12,IF(C27=\"Mo\",'meine Daten'!$H$13,IF(C27=\"Di\",'meine Daten'!$H$14,IF(C27=\"Mi\",'meine Daten'!$H$15,IF(C27=\"Do\",'meine Daten'!$H$16,IF(C27=\"Fr\",'meine Daten'!$H$17,IF(C27=\"Sa\",'meine Daten'!$H$18,IF(C27=\"So\",'meine Daten'!$H$19))))))))","v":"00:00:00"},"",null,null,null,"00:00:00",null,null,null,null,"00:00:00","00:00:00",null," ",{"$f":"IF(ISERROR(VLOOKUP(B27,Feiertage!$B$5:$B$21,1,FALSE)),WEEKDAY(B27,2),\"Feiertag\")","v":6},{"$f":"S26+IF(F27=\"Z\",-(#REF!*24),IF(G27=\"\",0,(O27+P27-D27)*24))","v":0}]
[null,"2023-06-18","So",{"$f":"IF(OR(E28=\"F\",F28=\"U\",F28=\"AU\"),'meine Daten'!$C$12,IF(C28=\"Mo\",'meine Daten'!$H$13,IF(C28=\"Di\",'meine Daten'!$H$14,IF(C28=\"Mi\",'meine Daten'!$H$15,IF(C28=\"Do\",'meine Daten'!$H$16,IF(C28=\"Fr\",'meine Daten'!$H$17,IF(C28=\"Sa\",'meine Daten'!$H$18,IF(C28=\"So\",'meine Daten'!$H$19))))))))","v":"00:00:00"},"",null,null,null,"00:00:00",null,null,null,null,"00:00:00","00:00:00",null," ",{"$f":"IF(ISERROR(VLOOKUP(B28,Feiertage!$B$5:$B$21,1,FALSE)),WEEKDAY(B28,2),\"Feiertag\")","v":7},{"$f":"S27+IF(F28=\"Z\",-(#REF!*24),IF(G28=\"\",0,(O28+P28-D28)*24))","v":0}]
[null,"2023-06-19","Mo",{"$f":"IF(OR(E29=\"F\",F29=\"U\",F29=\"AU\"),'meine Daten'!$C$12,IF(C29=\"Mo\",'meine Daten'!$H$13,IF(C29=\"Di\",'meine Daten'!$H$14,IF(C29=\"Mi\",'meine Daten'!$H$15,IF(C29=\"Do\",'meine Daten'!$H$16,IF(C29=\"Fr\",'meine Daten'!$H$17,IF(C29=\"Sa\",'meine Daten'!$H$18,IF(C29=\"So\",'meine Daten'!$H$19))))))))","v":"08:00:00"},"",null,null,null,"00:00:00",null,null,null,null,"00:00:00","00:00:00",null," ",{"$f":"IF(ISERROR(VLOOKUP(B29,Feiertage!$B$5:$B$21,1,FALSE)),WEEKDAY(B29,2),\"Feiertag\")","v":1},{"$f":"S28+IF(F29=\"Z\",-(#REF!*24),IF(G29=\"\",0,(O29+P29-D29)*24))","v":0}]
[null,"2023-06-20","Di",{"$f":"IF(OR(E30=\"F\",F30=\"U\",F30=\"AU\"),'meine Daten'!$C$12,IF(C30=\"Mo\",'meine Daten'!$H$13,IF(C30=\"Di\",'meine Daten'!$H$14,IF(C30=\"Mi\",'meine Daten'!$H$15,IF(C30=\"Do\",'meine Daten'!$H$16,IF(C30=\"Fr\",'meine Daten'!$H$17,IF(C30=\"Sa\",'meine Daten'!$H$18,IF(C30=\"So\",'meine Daten'!$H$19))))))))","v":"08:00:00"},"",null,null,null,"00:00:00",null,null,null,null,"00:00:00","00:00:00",null," ",{"$f":"IF(ISERROR(VLOOKUP(B30,Feiertage!$B$5:$B$21,1,FALSE)),WEEKDAY(B30,2),\"Feiertag\")","v":2},{"$f":"S29+IF(F30=\"Z\",-(#REF!*24),IF(G30=\"\",0,(O30+P30-D30)*24))","v":0}]
[null,"2023-06-21","Mi",{"$f":"IF(OR(E31=\"F\",F31=\"U\",F31=\"AU\"),'meine Daten'!$C$12,IF(C31=\"Mo\",'meine Daten'!$H$13,IF(C31=\"Di\",'meine Daten'!$H$14,IF(C31=\"Mi\",'meine Daten'!$H$15,IF(C31=\"Do\",'meine Daten'!$H$16,IF(C31=\"Fr\",'meine Daten'!$H$17,IF(C31=\"Sa\",'meine Daten'!$H$18,IF(C31=\"So\",'meine Daten'!$H$19))))))))","v":"08:00:00"},"",null,null,null,"00:00:00",null,null,null,null,"00:00:00","00:00:00",null," ",{"$f":"IF(ISERROR(VLOOKUP(B31,Feiertage!$B$5:$B$21,1,FALSE)),WEEKDAY(B31,2),\"Feiertag\")","v":3},{"$f":"S30+IF(F31=\"Z\",-(#REF!*24),IF(G31=\"\",0,(O31+P31-D31)*24))","v":0}]
[null,"2023-06-22","Do",{"$f":"IF(OR(E32=\"F\",F32=\"U\",F32=\"AU\"),'meine Daten'!$C$12,IF(C32=\"Mo\",'meine Daten'!$H$13,IF(C32=\"Di\",'meine Daten'!$H$14,IF(C32=\"Mi\",'meine Daten'!$H$15,IF(C32=\"Do\",'meine Daten'!$H$16,IF(C32=\"Fr\",'meine Daten'!$H$17,IF(C32=\"Sa\",'meine Daten'!$H$18,IF(C32=\"So\",'meine Daten'!$H$19))))))))","v":"08:00:00"},"",null,null,null,"00:00:00",null,null,null,null,"00:00:00","00:00:00",null," ",{"$f":"IF(ISERROR(VLOOKUP(B32,Feiertage!$B$5:$B$21,1,FALSE)),WEEKDAY(B32,2),\"Feiertag\")","v":4},{"$f":"S31+IF(F32=\"Z\",-(#REF!*24),IF(G32=\"\",0,(O32+P32-D32)*24))","v":0}]
[null,"2023-06-23","Fr",{"$f":"IF(OR(E33=\"F\",F33=\"U\",F33=\"AU\"),'meine Daten'!$C$12,IF(C33=\"Mo\",'meine Daten'!$H$13,IF(C33=\"Di\",'meine Daten'!$H$14,IF(C33=\"Mi\",'meine Daten'!$H$15,IF(C33=\"Do\",'meine Daten'!$H$16,IF(C33=\"Fr\",'meine Daten'!$H$17,IF(C33=\"Sa\",'meine Daten'!$H$18,IF(C33=\"So\",'meine Daten'!$H$19))))))))","v":"08:00:00"},"",null,null,null,"00:00:00",null,null,null,null,"00:00:00","00:00:00",null," ",{"$f":"IF(ISERROR(VLOOKUP(B33,Feiertage!$B$5:$B$21,1,FALSE)),WEEKDAY(B33,2),\"Feiertag\")","v":5},{"$f":"S32+IF(F33=\"Z\",-(#REF!*24),IF(G33=\"\",0,(O33+P33-D33)*24))","v":0}]
[null,"2023-06-24","Sa",{"$f":"IF(OR(E34=\"F\",F34=\"U\",F34=\"AU\"),'meine Daten'!$C$12,IF(C34=\"Mo\",'meine Daten'!$H$13,IF(C34=\"Di\",'meine Daten'!$H$14,IF(C34=\"Mi\",'meine Daten'!$H$15,IF(C34=\"Do\",'meine Daten'!$H$16,IF(C34=\"Fr\",'meine Daten'!$H$17,IF(C34=\"Sa\",'meine Daten'!$H$18,IF(C34=\"So\",'meine Daten'!$H$19))))))))","v":"00:00:00"},"",null,null,null,"00:00:00",null,null,null,null,"00:00:00","00:00:00",null," ",{"$f":"IF(ISERROR(VLOOKUP(B34,Feiertage!$B$5:$B$21,1,FALSE)),WEEKDAY(B34,2),\"Feiertag\")","v":6},{"$f":"S33+IF(F34=\"Z\",-(#REF!*24),IF(G34=\"\",0,(O34+P34-D34)*24))","v":0}]
[null,"2023-06-25","So",{"$f":"IF(OR(E35=\"F\",F35=\"U\",F35=\"AU\"),'meine Daten'!$C$12,IF(C35=\"Mo\",'meine Daten'!$H$13,IF(C35=\"Di\",'meine Daten'!$H$14,IF(C35=\"Mi\",'meine Daten'!$H$15,IF(C35=\"Do\",'meine Daten'!$H$16,IF(C35=\"Fr\",'meine Daten'!$H$17,IF(C35=\"Sa\",'meine Daten'!$H$18,IF(C35=\"So\",'meine Daten'!$H$19))))))))","v":"00:00:00"},"",null,null,null,"00:00:00",null,null,null,null,"00:00:00","00:00:00",null," ",{"$f":"IF(ISERROR(VLOOKUP(B35,Feiertage!$B$5:$B$21,1,FALSE)),WEEKDAY(B35,2),\"Feiertag\")","v":7},{"$f":"S34+IF(F35=\"Z\",-(#REF!*24),IF(G35=\"\",0,(O35+P35-D35)*24))","v":0}]
[null,"2023-06-26","Mo",{"$f":"IF(OR(E36=\"F\",F36=\"U\",F36=\"AU\"),'meine Daten'!$C$12,IF(C36=\"Mo\",'meine Daten'!$H$13,IF(C36=\"Di\",'meine Daten'!$H$14,IF(C36=\"Mi\",'meine Daten'!$H$15,IF(C36=\"Do\",'meine Daten'!$H$16,IF(C36=\"Fr\",'meine Daten'!$H$17,IF(C36=\"Sa\",'meine Daten'!$H$18,IF(C36=\"So\",'meine Daten'!$H$19))))))))","v":"08:00:00"},"",null,null,null,"00:00:00",null,null,null,null,"00:00:00","00:00:00",null," ",{"$f":"IF(ISERROR(VLOOKUP(B36,Feiertage!$B$5:$B$21,1,FALSE)),WEEKDAY(B36,2),\"Feiertag\")","v":1},{"$f":"S35+IF(F36=\"Z\",-(#REF!*24),IF(G36=\"\",0,(O36+P36-D36)*24))","v":0}]
[null,"2023-06-27","Di",{"$f":"IF(OR(E37=\"F\",F37=\"U\",F37=\"AU\"),'meine Daten'!$C$12,IF(C37=\"Mo\",'meine Daten'!$H$13,IF(C37=\"Di\",'meine Daten'!$H$14,IF(C37=\"Mi\",'meine Daten'!$H$15,IF(C37=\"Do\",'meine Daten'!$H$16,IF(C37=\"Fr\",'meine Daten'!$H$17,IF(C37=\"Sa\",'meine Daten'!$H$18,IF(C37=\"So\",'meine Daten'!$H$19))))))))","v":"08:00:00"},"",null,null,null,"00:00:00",null,null,null,null,"00:00:00","00:00:00",null," ",{"$f":"IF(ISERROR(VLOOKUP(B37,Feiertage!$B$5:$B$21,1,FALSE)),WEEKDAY(B37,2),\"Feiertag\")","v":2},{"$f":"S36+IF(F37=\"Z\",-(#REF!*24),IF(G37=\"\",0,(O37+P37-D37)*24))","v":0}]
[null,"2023-06-28","Mi",{"$f":"IF(OR(E38=\"F\",F38=\"U\",F38=\"AU\"),'meine Daten'!$C$12,IF(C38=\"Mo\",'meine Daten'!$H$13,IF(C38=\"Di\",'meine Daten'!$H$14,IF(C38=\"Mi\",'meine Daten'!$H$15,IF(C38=\"Do\",'meine Daten'!$H$16,IF(C38=\"Fr\",'meine Daten'!$H$17,IF(C38=\"Sa\",'meine Daten'!$H$18,IF(C38=\"So\",'meine Daten'!$H$19))))))))","v":"08:00:00"},"",null,null,null,"00:00:00",null,null,null,null,"00:00:00","00:00:00",null," ",{"$f":"IF(ISERROR(VLOOKUP(B38,Feiertage!$B$5:$B$21,1,FALSE)),WEEKDAY(B38,2),\"Feiertag\")","v":3},{"$f":"S37+IF(F38=\"Z\",-(#REF!*24),IF(G38=\"\",0,(O38+P38-D38)*24))","v":0},null,null,"Ich versichere die Richtigkeit meiner Angaben. Mir ist bekannt, "]
[null,"2023-06-29","Do",{"$f":"IF(OR(E39=\"F\",F39=\"U\",F39=\"AU\"),'meine Daten'!$C$12,IF(C39=\"Mo\",'meine Daten'!$H$13,IF(C39=\"Di\",'meine Daten'!$H$14,IF(C39=\"Mi\",'meine Daten'!$H$15,IF(C39=\"Do\",'meine Daten'!$H$16,IF(C39=\"Fr\",'meine Daten'!$H$17,IF(C39=\"Sa\",'meine Daten'!$H$18,IF(C39=\"So\",'meine Daten'!$H$19))))))))","v":"08:00:00"},"",null,null,null,"00:00:00",null,null,null,null,"00:00:00","00:00:00",null," ",{"$f":"IF(ISERROR(VLOOKUP(B39,Feiertage!$B$5:$B$21,1,FALSE)),WEEKDAY(B39,2),\"Feiertag\")","v":4},{"$f":"S38+IF(F39=\"Z\",-(#REF!*24),IF(G39=\"\",0,(O39+P39-D39)*24))","v":0},null,null,"dass unrichtige Angaben eine grobe Pflichtverletzung darstellen. "]
[null,"2023-06-30","Fr",{"$f":"IF(OR(E40=\"F\",F40=\"U\",F40=\"AU\"),'meine Daten'!$C$12,IF(C40=\"Mo\",'meine Daten'!$H$13,IF(C40=\"Di\",'meine Daten'!$H$14,IF(C40=\"Mi\",'meine Daten'!$H$15,IF(C40=\"Do\",'meine Daten'!$H$16,IF(C40=\"Fr\",'meine Daten'!$H$17,IF(C40=\"Sa\",'meine Daten'!$H$18,IF(C40=\"So\",'meine Daten'!$H$19))))))))","v":"08:00:00"},null,null,null,null,"00:00:00",null,null,null,null,"00:00:00","00:00:00",null," ",{"$f":"IF(ISERROR(VLOOKUP(B40,Feiertage!$B$5:$B$21,1,FALSE)),WEEKDAY(B40,2),\"Feiertag\")","v":5},{"$f":"#REF!+IF(F40=\"Z\",-(#REF!*24),IF(G40=\"\",0,(O40+P40-D40)*24))","v":{"$error":"#REF!"}}]
[null,null,null,null,null,{"$f":"COUNTIF(F13:F40,\"U\")+COUNTIF(F13:F40,\"Z\")+COUNTIF(F13:F40,AU)","v":0},{"$f":"IF(SUM(G13:G40)<=0,0,1)","v":0},null,null,null,null,null,null,null,null,null,{"$f":"SUM(Q11:Q40)","v":0}]
[null,null,null,null,null,null,null,null,null,null,null,null,null,"Monatssaldo:",null,null,{"$f":"IF(F41+G41=0,\"\",SUM(Q11:Q40))","v":""}]
[null,null,null,null,null,null,null,null,null,null,null,null,null,"Gleitzeitkontostand:",null,null,{"$f":"IF(OR(Q10=\"\",Q42=\"\"),\"\",Q10+Q42)","v":""}]
[null,null,null,null,null,null,null,null,null,null,null,null,null,"(In Stunden:Minuten)",null,null,null,null,null,null,null,"Datum, Unterschrift"]
[]
[null,null,null,null,null,null,null,null,null,null,null,null,null,"Urlaubstage",null,null,{"$f":"COUNTIF(F11:F40,\"U\")","v":0},null,null,null,null,null,"„Der Arbeitszeit-Checker“ von Simone Back für www.arbeitszeit-klug-gestalten.de "]
[]
[null,null,null,null,null,null,null,null,null,null,null,null,null,null,null,null,null,null,null,null,null,null,"ist lizensiert unter einer Creative Commons Lizenz CC BY SA 4.0 \n(Nutzung bei Namensnennung, Weitergabe unter gleichen Bedingungen)",null,null,null,null,null,"„Der Arbeitszeit-Checker“ von Simone Back für www.arbeitszeit-klug-gestalten.de"]
[null,null,null,null,null,null,null,null,null,null,null,null,null,null,null,null,null,null,null,null,null,"Copyright für das Logo \"Arbeitszeit klug gestalten\": RKW Hessen. Das Logo darf nur für den Checker in der Ursprungsform genutzt werden.",null,null,null,null,null,null,"ist lizensiert unter einer Creative Commons Lizenz CC BY SA 4.0\n(Nutzung bei Namensnennung, Weitergabe unter gleichen Bedingungen)"]

{"sheet":"Juli","index":8,"n_rows":49,"n_cols":23,"rows_kept":49,"cut":false,"hidden":false,"merged":[[48,21,48,25],[45,22,46,25],[9,1,9,15],[47,1,47,2],[3,15,3,16],[6,1,8,1],[6,2,8,2],[6,3,8,3],[6,4,8,4],[6,5,8,5],[6,15,7,15],[7,9,7,10],[7,11,7,12],[47,22,47,25]]}
[null,"Arbeitszeit-Nachweis",null,null,null,null,null,"Name:",null,{"$f":"IF('meine Daten'!C3=\"\",\"\",'meine Daten'!C3)","v":""},null,null,null,null,null,null,null,null,{"$f":"B11","v":"2023-07-01"},{"$f":"B11","v":"2023-07-01"}]
[]
[null,null,null,null,"Symbol* :  ","U","=Urlaub"]
[null,null,null,null,null,"AU","=Krank/Kur",null,null,null,null,null,null,null,"bedeutet:","Eintrag fehlt "]
[null,null,null,null,null,"Z","Zeitausgleich (ganzer Tag)",null,null,null,null,null,null,null,"bedeutet:","mehr als 10 Stunden"]
[]
[null,"Datum","Tag","Sollzeit","Feiertag","Symbol *","Brutto-Arbeitszeit",null,null,"Pausen",null,null,null,null,"Netto","weitere\nReisezeit","Saldo"]
[null,null,null,null,null,null,null,null,null,"Mittag",null,"weitere\n(Std:Min)",null,"Summe","Arbeits-\nzeit",null,"Arbeits-\nzeit"]
[null,null,null,null,null,null,"von","bis","Std:Min","von","bis","I","II","./.Std:Min","Std:Min","Std:Min","Std:Min",null,null,"Bemerkung"]
[null,"Übertrag vom Vormonat: ",null,null,null,null,null,null,null,null,null,null,null,null,null,null,{"$f":"Juni!Q43","v":""}]
[null,{"$f":"Juni!B40+1","v":"2023-07-01"},{"$f":"TEXT(B11,\"TTT\")","v":"Sa"},{"$f":"IF(OR(E11=\"F\",F11=\"U\",F11=\"AU\"),'meine Daten'!$C$12,IF(C11=\"Mo\",'meine Daten'!$H$21,IF(C11=\"Di\",'meine Daten'!$H$22,IF(C11=\"Mi\",'meine Daten'!$H$23,IF(C11=\"Do\",'meine Daten'!$H$24,IF(C11=\"Fr\",'meine Daten'!$H$25,IF(C11=\"Sa\",'meine Daten'!$H$26,IF(C11=\"So\",'meine Daten'!$H$27))))))))","v":"00:00:00"},{"$f":"IF(R11=\"Feiertag\",\"F\",\"\")","v":""},null,null,null,{"$f":"H11-G11","v":"00:00:00"},null,null,null,null,{"$f":"K11-J11+L11+M11","v":"00:00:00"},{"$f":"I11-N11","v":"00:00:00"},null,{"$f":"IF(F11=\"Z\",-(D11),IF(G11=\"\",\" \",IF(O11+P11>D11,O11+P11-D11,IF(O11+P11<D11,-(D11-O11-P11),\" \"))))","v":" "},{"$f":"IF(ISERROR(VLOOKUP(B11,Feiertage!$B$5:$B$21,1,FALSE)),WEEKDAY(B11,2),\"Feiertag\")","v":6},{"$f":"IF(G11=\"\",0,(O11+P11-D11)*24)","v":0}]
[null,{"$f":"B11+1","v":"2023-07-02"},{"$f":"TEXT(B12,\"TTT\")","v":"So"},{"$f":"IF(OR(E12=\"F\",F12=\"U\",F12=\"AU\"),'meine Daten'!$C$12,IF(C12=\"Mo\",'meine Daten'!$H$21,IF(C12=\"Di\",'meine Daten'!$H$22,IF(C12=\"Mi\",'meine Daten'!$H$23,IF(C12=\"Do\",'meine Daten'!$H$24,IF(C12=\"Fr\",'meine Daten'!$H$25,IF(C12=\"Sa\",'meine Daten'!$H$26,IF(C12=\"So\",'meine Daten'!$H$27))))))))","v":"00:00:00"},"",null,null,null,{"$f":"H12-G12","v":"00:00:00"},null,null,null,null,{"$f":"K12-J12+L12+M12","v":"00:00:00"},"00:00:00",null,{"$f":"IF(F12=\"Z\",-(D12),IF(G12=\"\",\" \",IF(O12+P12>D12,O12+P12-D12,IF(O12+P12<D12,-(D12-O12-P12),\" \"))))","v":" "},{"$f":"IF(ISERROR(VLOOKUP(B12,Feiertage!$B$5:$B$21,1,FALSE)),WEEKDAY(B12,2),\"Feiertag\")","v":7},{"$f":"S11+IF(F12=\"Z\",-(#REF!*24),IF(G12=\"\",0,(O12+P12-D12)*24))","v":0}]
[null,{"$f":"B12+1","v":"2023-07-03"},"Mo",{"$f":"IF(OR(E13=\"F\",F13=\"U\",F13=\"AU\"),'meine Daten'!$C$12,IF(C13=\"Mo\",'meine Daten'!$H$21,IF(C13=\"Di\",'meine Daten'!$H$22,IF(C13=\"Mi\",'meine Daten'!$H$23,IF(C13=\"Do\",'meine Daten'!$H$24,IF(C13=\"Fr\",'meine Daten'!$H$25,IF(C13=\"Sa\",'meine Daten'!$H$26,IF(C13=\"So\",'meine Daten'!$H$27))))))))","v":"08:00:00"},"",null,null,null,{"$f":"H13-G13","v":"00:00:00"},null,null,null,null,"00:00:00","00:00:00",null," ",{"$f":"IF(ISERROR(VLOOKUP(B13,Feiertage!$B$5:$B$21,1,FALSE)),WEEKDAY(B13,2),\"Feiertag\")","v":1},{"$f":"S12+IF(F13=\"Z\",-(#REF!*24),IF(G13=\"\",0,(O13+P13-D13)*24))","v":0}]
[null,"2023-07-04","Di",{"$f":"IF(OR(E14=\"F\",F14=\"U\",F14=\"AU\"),'meine Daten'!$C$12,IF(C14=\"Mo\",'meine Daten'!$H$21,IF(C14=\"Di\",'meine Daten'!$H$22,IF(C14=\"Mi\",'meine Daten'!$H$23,IF(C14=\"Do\",'meine Daten'!$H$24,IF(C14=\"Fr\",'meine Daten'!$H$25,IF(C14=\"Sa\",'meine Daten'!$H$26,IF(C14=\"So\",'meine Daten'!$H$27))))))))","v":"08:00:00"},"",null,null,null,"00:00:00",null,null,null,null,"00:00:00","00:00:00",null," ",{"$f":"IF(ISERROR(VLOOKUP(B14,Feiertage!$B$5:$B$21,1,FALSE)),WEEKDAY(B14,2),\"Feiertag\")","v":2},{"$f":"S13+IF(F14=\"Z\",-(#REF!*24),IF(G14=\"\",0,(O14+P14-D14)*24))","v":0}]
[null,"2023-07-05","Mi",{"$f":"IF(OR(E15=\"F\",F15=\"U\",F15=\"AU\"),'meine Daten'!$C$12,IF(C15=\"Mo\",'meine Daten'!$H$21,IF(C15=\"Di\",'meine Daten'!$H$22,IF(C15=\"Mi\",'meine Daten'!$H$23,IF(C15=\"Do\",'meine Daten'!$H$24,IF(C15=\"Fr\",'meine Daten'!$H$25,IF(C15=\"Sa\",'meine Daten'!$H$26,IF(C15=\"So\",'meine Daten'!$H$27))))))))","v":"08:00:00"},"",null,null,null,"00:00:00",null,null,null,null,"00:00:00","00:00:00",null," ",{"$f":"IF(ISERROR(VLOOKUP(B15,Feiertage!$B$5:$B$21,1,FALSE)),WEEKDAY(B15,2),\"Feiertag\")","v":3},{"$f":"S14+IF(F15=\"Z\",-(#REF!*24),IF(G15=\"\",0,(O15+P15-D15)*24))","v":0}]
[null,"2023-07-06","Do",{"$f":"IF(OR(E16=\"F\",F16=\"U\",F16=\"AU\"),'meine Daten'!$C$12,IF(C16=\"Mo\",'meine Daten'!$H$21,IF(C16=\"Di\",'meine Daten'!$H$22,IF(C16=\"Mi\",'meine Daten'!$H$23,IF(C16=\"Do\",'meine Daten'!$H$24,IF(C16=\"Fr\",'meine Daten'!$H$25,IF(C16=\"Sa\",'meine Daten'!$H$26,IF(C16=\"So\",'meine Daten'!$H$27))))))))","v":"08:00:00"},"",null,null,null,"00:00:00",null,null,null,null,"00:00:00","00:00:00",null," ",{"$f":"IF(ISERROR(VLOOKUP(B16,Feiertage!$B$5:$B$21,1,FALSE)),WEEKDAY(B16,2),\"Feiertag\")","v":4},{"$f":"S15+IF(F16=\"Z\",-(#REF!*24),IF(G16=\"\",0,(O16+P16-D16)*24))","v":0}]
[null,"2023-07-07","Fr",{"$f":"IF(OR(E17=\"F\",F17=\"U\",F17=\"AU\"),'meine Daten'!$C$12,IF(C17=\"Mo\",'meine Daten'!$H$21,IF(C17=\"Di\",'meine Daten'!$H$22,IF(C17=\"Mi\",'meine Daten'!$H$23,IF(C17=\"Do\",'meine Daten'!$H$24,IF(C17=\"Fr\",'meine Daten'!$H$25,IF(C17=\"Sa\",'meine Daten'!$H$26,IF(C17=\"So\",'meine Daten'!$H$27))))))))","v":"08:00:00"},"",null,null,null,"00:00:00",null,null,null,null,"00:00:00","00:00:00",null," ",{"$f":"IF(ISERROR(VLOOKUP(B17,Feiertage!$B$5:$B$21,1,FALSE)),WEEKDAY(B17,2),\"Feiertag\")","v":5},{"$f":"S16+IF(F17=\"Z\",-(#REF!*24),IF(G17=\"\",0,(O17+P17-D17)*24))","v":0}]
[null,"2023-07-08","Sa",{"$f":"IF(OR(E18=\"F\",F18=\"U\",F18=\"AU\"),'meine Daten'!$C$12,IF(C18=\"Mo\",'meine Daten'!$H$21,IF(C18=\"Di\",'meine Daten'!$H$22,IF(C18=\"Mi\",'meine Daten'!$H$23,IF(C18=\"Do\",'meine Daten'!$H$24,IF(C18=\"Fr\",'meine Daten'!$H$25,IF(C18=\"Sa\",'meine Daten'!$H$26,IF(C18=\"So\",'meine Daten'!$H$27))))))))","v":"00:00:00"},"",null,null,null,"00:00:00",null,null,null,null,"00:00:00","00:00:00",null," ",{"$f":"IF(ISERROR(VLOOKUP(B18,Feiertage!$B$5:$B$21,1,FALSE)),WEEKDAY(B18,2),\"Feiertag\")","v":6},{"$f":"S17+IF(F18=\"Z\",-(#REF!*24),IF(G18=\"\",0,(O18+P18-D18)*24))","v":0}]
[null,"2023-07-09","So",{"$f":"IF(OR(E19=\"F\",F19=\"U\",F19=\"AU\"),'meine Daten'!$C$12,IF(C19=\"Mo\",'meine Daten'!$H$21,IF(C19=\"Di\",'meine Daten'!$H$22,IF(C19=\"Mi\",'meine Daten'!$H$23,IF(C19=\"Do\",'meine Daten'!$H$24,IF(C19=\"Fr\",'meine Daten'!$H$25,IF(C19=\"Sa\",'meine Daten'!$H$26,IF(C19=\"So\",'meine Daten'!$H$27))))))))","v":"00:00:00"},"",null,null,null,"00:00:00",null,null,null,null,"00:00:00","00:00:00",null," ",{"$f":"IF(ISERROR(VLOOKUP(B19,Feiertage!$B$5:$B$21,1,FALSE)),WEEKDAY(B19,2),\"Feiertag\")","v":7},{"$f":"S18+IF(F19=\"Z\",-(#REF!*24),IF(G19=\"\",0,(O19+P19-D19)*24))","v":0}]
[null,"2023-07-10","Mo",{"$f":"IF(OR(E20=\"F\",F20=\"U\",F20=\"AU\"),'meine Daten'!$C$12,IF(C20=\"Mo\",'meine Daten'!$H$21,IF(C20=\"Di\",'meine Daten'!$H$22,IF(C20=\"Mi\",'meine Daten'!$H$23,IF(C20=\"Do\",'meine Daten'!$H$24,IF(C20=\"Fr\",'meine Daten'!$H$25,IF(C20=\"Sa\",'meine Daten'!$H$26,IF(C20=\"So\",'meine Daten'!$H$27))))))))","v":"08:00:00"},"",null,null,null,"00:00:00",null,null,null,null,"00:00:00","00:00:00",null," ",{"$f":"IF(ISERROR(VLOOKUP(B20,Feiertage!$B$5:$B$21,1,FALSE)),WEEKDAY(B20,2),\"Feiertag\")","v":1},{"$f":"S19+IF(F20=\"Z\",-(#REF!*24),IF(G20=\"\",0,(O20+P20-D20)*24))","v":0}]
[null,"2023-07-11","Di",{"$f":"IF(OR(E21=\"F\",F21=\"U\",F21=\"AU\"),'meine Daten'!$C$12,IF(C21=\"Mo\",'meine Daten'!$H$21,IF(C21=\"Di\",'meine Daten'!$H$22,IF(C21=\"Mi\",'meine Daten'!$H$23,IF(C21=\"Do\",'meine Daten'!$H$24,IF(C21=\"Fr\",'meine Daten'!$H$25,IF(C21=\"Sa\",'meine Daten'!$H$26,IF(C21=\"So\",'meine Daten'!$H$27))))))))","v":"08:00:00"},"",null,null,null,"00:00:00",null,null,null,null,"00:00:00","00:00:00",null," ",{"$f":"IF(ISERROR(VLOOKUP(B21,Feiertage!$B$5:$B$21,1,FALSE)),WEEKDAY(B21,2),\"Feiertag\")","v":2},{"$f":"S20+IF(F21=\"Z\",-(#REF!*24),IF(G21=\"\",0,(O21+P21-D21)*24))","v":0}]
[null,"2023-07-12","Mi",{"$f":"IF(OR(E22=\"F\",F22=\"U\",F22=\"AU\"),'meine Daten'!$C$12,IF(C22=\"Mo\",'meine Daten'!$H$21,IF(C22=\"Di\",'meine Daten'!$H$22,IF(C22=\"Mi\",'meine Daten'!$H$23,IF(C22=\"Do\",'meine Daten'!$H$24,IF(C22=\"Fr\",'meine Daten'!$H$25,IF(C22=\"Sa\",'meine Daten'!$H$26,IF(C22=\"So\",'meine Daten'!$H$27))))))))","v":"08:00:00"},"",null,null,null,"00:00:00",null,null,null,null,"00:00:00","00:00:00",null," ",{"$f":"IF(ISERROR(VLOOKUP(B22,Feiertage!$B$5:$B$21,1,FALSE)),WEEKDAY(B22,2),\"Feiertag\")","v":3},{"$f":"S21+IF(F22=\"Z\",-(#REF!*24),IF(G22=\"\",0,(O22+P22-D22)*24))","v":0}]
[null,"2023-07-13","Do",{"$f":"IF(OR(E23=\"F\",F23=\"U\",F23=\"AU\"),'meine Daten'!$C$12,IF(C23=\"Mo\",'meine Daten'!$H$21,IF(C23=\"Di\",'meine Daten'!$H$22,IF(C23=\"Mi\",'meine Daten'!$H$23,IF(C23=\"Do\",'meine Daten'!$H$24,IF(C23=\"Fr\",'meine Daten'!$H$25,IF(C23=\"Sa\",'meine Daten'!$H$26,IF(C23=\"So\",'meine Daten'!$H$27))))))))","v":"08:00:00"},"",null,null,null,"00:00:00",null,null,null,null,"00:00:00","00:00:00",null," ",{"$f":"IF(ISERROR(VLOOKUP(B23,Feiertage!$B$5:$B$21,1,FALSE)),WEEKDAY(B23,2),\"Feiertag\")","v":4},{"$f":"S22+IF(F23=\"Z\",-(#REF!*24),IF(G23=\"\",0,(O23+P23-D23)*24))","v":0}]
[null,"2023-07-14","Fr",{"$f":"IF(OR(E24=\"F\",F24=\"U\",F24=\"AU\"),'meine Daten'!$C$12,IF(C24=\"Mo\",'meine Daten'!$H$21,IF(C24=\"Di\",'meine Daten'!$H$22,IF(C24=\"Mi\",'meine Daten'!$H$23,IF(C24=\"Do\",'meine Daten'!$H$24,IF(C24=\"Fr\",'meine Daten'!$H$25,IF(C24=\"Sa\",'meine Daten'!$H$26,IF(C24=\"So\",'meine Daten'!$H$27))))))))","v":"08:00:00"},"",null,null,null,"00:00:00",null,null,null,null,"00:00:00","00:00:00",null," ",{"$f":"IF(ISERROR(VLOOKUP(B24,Feiertage!$B$5:$B$21,1,FALSE)),WEEKDAY(B24,2),\"Feiertag\")","v":5},{"$f":"S23+IF(F24=\"Z\",-(#REF!*24),IF(G24=\"\",0,(O24+P24-D24)*24))","v":0}]
[null,"2023-07-15","Sa",{"$f":"IF(OR(E25=\"F\",F25=\"U\",F25=\"AU\"),'meine Daten'!$C$12,IF(C25=\"Mo\",'meine Daten'!$H$21,IF(C25=\"Di\",'meine Daten'!$H$22,IF(C25=\"Mi\",'meine Daten'!$H$23,IF(C25=\"Do\",'meine Daten'!$H$24,IF(C25=\"Fr\",'meine Daten'!$H$25,IF(C25=\"Sa\",'meine Daten'!$H$26,IF(C25=\"So\",'meine Daten'!$H$27))))))))","v":"00:00:00"},"",null,null,null,"00:00:00",null,null,null,null,"00:00:00","00:00:00",null," ",{"$f":"IF(ISERROR(VLOOKUP(B25,Feiertage!$B$5:$B$21,1,FALSE)),WEEKDAY(B25,2),\"Feiertag\")","v":6},{"$f":"S24+IF(F25=\"Z\",-(#REF!*24),IF(G25=\"\",0,(O25+P25-D25)*24))","v":0}]
[null,"2023-07-16","So",{"$f":"IF(OR(E26=\"F\",F26=\"U\",F26=\"AU\"),'meine Daten'!$C$12,IF(C26=\"Mo\",'meine Daten'!$H$21,IF(C26=\"Di\",'meine Daten'!$H$22,IF(C26=\"Mi\",'meine Daten'!$H$23,IF(C26=\"Do\",'meine Daten'!$H$24,IF(C26=\"Fr\",'meine Daten'!$H$25,IF(C26=\"Sa\",'meine Daten'!$H$26,IF(C26=\"So\",'meine Daten'!$H$27))))))))","v":"00:00:00"},"",null,null,null,"00:00:00",null,null,null,null,"00:00:00","00:00:00",null," ",{"$f":"IF(ISERROR(VLOOKUP(B26,Feiertage!$B$5:$B$21,1,FALSE)),WEEKDAY(B26,2),\"Feiertag\")","v":7},{"$f":"S25+IF(F26=\"Z\",-(#REF!*24),IF(G26=\"\",0,(O26+P26-D26)*24))","v":0}]
[null,"2023-07-17","Mo",{"$f":"IF(OR(E27=\"F\",F27=\"U\",F27=\"AU\"),'meine Daten'!$C$12,IF(C27=\"Mo\",'meine Daten'!$H$21,IF(C27=\"Di\",'meine Daten'!$H$22,IF(C27=\"Mi\",'meine Daten'!$H$23,IF(C27=\"Do\",'meine Daten'!$H$24,IF(C27=\"Fr\",'meine Daten'!$H$25,IF(C27=\"Sa\",'meine Daten'!$H$26,IF(C27=\"So\",'meine Daten'!$H$27))))))))","v":"08:00:00"},"",null,null,null,"00:00:00",null,null,null,null,"00:00:00","00:00:00",null," ",{"$f":"IF(ISERROR(VLOOKUP(B27,Feiertage!$B$5:$B$21,1,FALSE)),WEEKDAY(B27,2),\"Feiertag\")","v":1},{"$f":"S26+IF(F27=\"Z\",-(#REF!*24),IF(G27=\"\",0,(O27+P27-D27)*24))","v":0}]
[null,"2023-07-18","Di",{"$f":"IF(OR(E28=\"F\",F28=\"U\",F28=\"AU\"),'meine Daten'!$C$12,IF(C28=\"Mo\",'meine Daten'!$H$21,IF(C28=\"Di\",'meine Daten'!$H$22,IF(C28=\"Mi\",'meine Daten'!$H$23,IF(C28=\"Do\",'meine Daten'!$H$24,IF(C28=\"Fr\",'meine Daten'!$H$25,IF(C28=\"Sa\",'meine Daten'!$H$26,IF(C28=\"So\",'meine Daten'!$H$27))))))))","v":"08:00:00"},"",null,null,null,"00:00:00",null,null,null,null,"00:00:00","00:00:00",null," ",{"$f":"IF(ISERROR(VLOOKUP(B28,Feiertage!$B$5:$B$21,1,FALSE)),WEEKDAY(B28,2),\"Feiertag\")","v":2},{"$f":"S27+IF(F28=\"Z\",-(#REF!*24),IF(G28=\"\",0,(O28+P28-D28)*24))","v":0}]
[null,"2023-07-19","Mi",{"$f":"IF(OR(E29=\"F\",F29=\"U\",F29=\"AU\"),'meine Daten'!$C$12,IF(C29=\"Mo\",'meine Daten'!$H$21,IF(C29=\"Di\",'meine Daten'!$H$22,IF(C29=\"Mi\",'meine Daten'!$H$23,IF(C29=\"Do\",'meine Daten'!$H$24,IF(C29=\"Fr\",'meine Daten'!$H$25,IF(C29=\"Sa\",'meine Daten'!$H$26,IF(C29=\"So\",'meine Daten'!$H$27))))))))","v":"08:00:00"},"",null,null,null,"00:00:00",null,null,null,null,"00:00:00","00:00:00",null," ",{"$f":"IF(ISERROR(VLOOKUP(B29,Feiertage!$B$5:$B$21,1,FALSE)),WEEKDAY(B29,2),\"Feiertag\")","v":3},{"$f":"S28+IF(F29=\"Z\",-(#REF!*24),IF(G29=\"\",0,(O29+P29-D29)*24))","v":0}]
[null,"2023-07-20","Do",{"$f":"IF(OR(E30=\"F\",F30=\"U\",F30=\"AU\"),'meine Daten'!$C$12,IF(C30=\"Mo\",'meine Daten'!$H$21,IF(C30=\"Di\",'meine Daten'!$H$22,IF(C30=\"Mi\",'meine Daten'!$H$23,IF(C30=\"Do\",'meine Daten'!$H$24,IF(C30=\"Fr\",'meine Daten'!$H$25,IF(C30=\"Sa\",'meine Daten'!$H$26,IF(C30=\"So\",'meine Daten'!$H$27))))))))","v":"08:00:00"},"",null,null,null,"00:00:00",null,null,null,null,"00:00:00","00:00:00",null," ",{"$f":"IF(ISERROR(VLOOKUP(B30,Feiertage!$B$5:$B$21,1,FALSE)),WEEKDAY(B30,2),\"Feiertag\")","v":4},{"$f":"S29+IF(F30=\"Z\",-(#REF!*24),IF(G30=\"\",0,(O30+P30-D30)*24))","v":0}]
[null,"2023-07-21","Fr",{"$f":"IF(OR(E31=\"F\",F31=\"U\",F31=\"AU\"),'meine Daten'!$C$12,IF(C31=\"Mo\",'meine Daten'!$H$21,IF(C31=\"Di\",'meine Daten'!$H$22,IF(C31=\"Mi\",'meine Daten'!$H$23,IF(C31=\"Do\",'meine Daten'!$H$24,IF(C31=\"Fr\",'meine Daten'!$H$25,IF(C31=\"Sa\",'meine Daten'!$H$26,IF(C31=\"So\",'meine Daten'!$H$27))))))))","v":"08:00:00"},"",null,null,null,"00:00:00",null,null,null,null,"00:00:00","00:00:00",null," ",{"$f":"IF(ISERROR(VLOOKUP(B31,Feiertage!$B$5:$B$21,1,FALSE)),WEEKDAY(B31,2),\"Feiertag\")","v":5},{"$f":"S30+IF(F31=\"Z\",-(#REF!*24),IF(G31=\"\",0,(O31+P31-D31)*24))","v":0}]
[null,"2023-07-22","Sa",{"$f":"IF(OR(E32=\"F\",F32=\"U\",F32=\"AU\"),'meine Daten'!$C$12,IF(C32=\"Mo\",'meine Daten'!$H$21,IF(C32=\"Di\",'meine Daten'!$H$22,IF(C32=\"Mi\",'meine Daten'!$H$23,IF(C32=\"Do\",'meine Daten'!$H$24,IF(C32=\"Fr\",'meine Daten'!$H$25,IF(C32=\"Sa\",'meine Daten'!$H$26,IF(C32=\"So\",'meine Daten'!$H$27))))))))","v":"00:00:00"},"",null,null,null,"00:00:00",null,null,null,null,"00:00:00","00:00:00",null," ",{"$f":"IF(ISERROR(VLOOKUP(B32,Feiertage!$B$5:$B$21,1,FALSE)),WEEKDAY(B32,2),\"Feiertag\")","v":6},{"$f":"S31+IF(F32=\"Z\",-(#REF!*24),IF(G32=\"\",0,(O32+P32-D32)*24))","v":0}]
[null,"2023-07-23","So",{"$f":"IF(OR(E33=\"F\",F33=\"U\",F33=\"AU\"),'meine Daten'!$C$12,IF(C33=\"Mo\",'meine Daten'!$H$21,IF(C33=\"Di\",'meine Daten'!$H$22,IF(C33=\"Mi\",'meine Daten'!$H$23,IF(C33=\"Do\",'meine Daten'!$H$24,IF(C33=\"Fr\",'meine Daten'!$H$25,IF(C33=\"Sa\",'meine Daten'!$H$26,IF(C33=\"So\",'meine Daten'!$H$27))))))))","v":"00:00:00"},"",null,null,null,"00:00:00",null,null,null,null,"00:00:00","00:00:00",null," ",{"$f":"IF(ISERROR(VLOOKUP(B33,Feiertage!$B$5:$B$21,1,FALSE)),WEEKDAY(B33,2),\"Feiertag\")","v":7},{"$f":"S32+IF(F33=\"Z\",-(#REF!*24),IF(G33=\"\",0,(O33+P33-D33)*24))","v":0}]
[null,"2023-07-24","Mo",{"$f":"IF(OR(E34=\"F\",F34=\"U\",F34=\"AU\"),'meine Daten'!$C$12,IF(C34=\"Mo\",'meine Daten'!$H$21,IF(C34=\"Di\",'meine Daten'!$H$22,IF(C34=\"Mi\",'meine Daten'!$H$23,IF(C34=\"Do\",'meine Daten'!$H$24,IF(C34=\"Fr\",'meine Daten'!$H$25,IF(C34=\"Sa\",'meine Daten'!$H$26,IF(C34=\"So\",'meine Daten'!$H$27))))))))","v":"08:00:00"},"",null,null,null,"00:00:00",null,null,null,null,"00:00:00","00:00:00",null," ",{"$f":"IF(ISERROR(VLOOKUP(B34,Feiertage!$B$5:$B$21,1,FALSE)),WEEKDAY(B34,2),\"Feiertag\")","v":1},{"$f":"S33+IF(F34=\"Z\",-(#REF!*24),IF(G34=\"\",0,(O34+P34-D34)*24))","v":0}]
[null,"2023-07-25","Di",{"$f":"IF(OR(E35=\"F\",F35=\"U\",F35=\"AU\"),'meine Daten'!$C$12,IF(C35=\"Mo\",'meine Daten'!$H$21,IF(C35=\"Di\",'meine Daten'!$H$22,IF(C35=\"Mi\",'meine Daten'!$H$23,IF(C35=\"Do\",'meine Daten'!$H$24,IF(C35=\"Fr\",'meine Daten'!$H$25,IF(C35=\"Sa\",'meine Daten'!$H$26,IF(C35=\"So\",'meine Daten'!$H$27))))))))","v":"08:00:00"},"",null,null,null,"00:00:00",null,null,null,null,"00:00:00","00:00:00",null," ",{"$f":"IF(ISERROR(VLOOKUP(B35,Feiertage!$B$5:$B$21,1,FALSE)),WEEKDAY(B35,2),\"Feiertag\")","v":2},{"$f":"S34+IF(F35=\"Z\",-(#REF!*24),IF(G35=\"\",0,(O35+P35-D35)*24))","v":0}]
[null,"2023-07-26","Mi",{"$f":"IF(OR(E36=\"F\",F36=\"U\",F36=\"AU\"),'meine Daten'!$C$12,IF(C36=\"Mo\",'meine Daten'!$H$21,IF(C36=\"Di\",'meine Daten'!$H$22,IF(C36=\"Mi\",'meine Daten'!$H$23,IF(C36=\"Do\",'meine Daten'!$H$24,IF(C36=\"Fr\",'meine Daten'!$H$25,IF(C36=\"Sa\",'meine Daten'!$H$26,IF(C36=\"So\",'meine Daten'!$H$27))))))))","v":"08:00:00"},"",null,null,null,"00:00:00",null,null,null,null,"00:00:00","00:00:00",null," ",{"$f":"IF(ISERROR(VLOOKUP(B36,Feiertage!$B$5:$B$21,1,FALSE)),WEEKDAY(B36,2),\"Feiertag\")","v":3},{"$f":"S35+IF(F36=\"Z\",-(#REF!*24),IF(G36=\"\",0,(O36+P36-D36)*24))","v":0}]
[null,"2023-07-27","Do",{"$f":"IF(OR(E37=\"F\",F37=\"U\",F37=\"AU\"),'meine Daten'!$C$12,IF(C37=\"Mo\",'meine Daten'!$H$21,IF(C37=\"Di\",'meine Daten'!$H$22,IF(C37=\"Mi\",'meine Daten'!$H$23,IF(C37=\"Do\",'meine Daten'!$H$24,IF(C37=\"Fr\",'meine Daten'!$H$25,IF(C37=\"Sa\",'meine Daten'!$H$26,IF(C37=\"So\",'meine Daten'!$H$27))))))))","v":"08:00:00"},"",null,null,null,"00:00:00",null,null,null,null,"00:00:00","00:00:00",null," ",{"$f":"IF(ISERROR(VLOOKUP(B37,Feiertage!$B$5:$B$21,1,FALSE)),WEEKDAY(B37,2),\"Feiertag\")","v":4},{"$f":"S36+IF(F37=\"Z\",-(#REF!*24),IF(G37=\"\",0,(O37+P37-D37)*24))","v":0}]
[null,"2023-07-28","Fr",{"$f":"IF(OR(E38=\"F\",F38=\"U\",F38=\"AU\"),'meine Daten'!$C$12,IF(C38=\"Mo\",'meine Daten'!$H$21,IF(C38=\"Di\",'meine Daten'!$H$22,IF(C38=\"Mi\",'meine Daten'!$H$23,IF(C38=\"Do\",'meine Daten'!$H$24,IF(C38=\"Fr\",'meine Daten'!$H$25,IF(C38=\"Sa\",'meine Daten'!$H$26,IF(C38=\"So\",'meine Daten'!$H$27))))))))","v":"08:00:00"},"",null,null,null,"00:00:00",null,null,null,null,"00:00:00","00:00:00",null," ",{"$f":"IF(ISERROR(VLOOKUP(B38,Feiertage!$B$5:$B$21,1,FALSE)),WEEKDAY(B38,2),\"Feiertag\")","v":5},{"$f":"S37+IF(F38=\"Z\",-(#REF!*24),IF(G38=\"\",0,(O38+P38-D38)*24))","v":0},null,null,"Ich versichere die Richtigkeit meiner Angaben. Mir ist bekannt, "]
[null,"2023-07-29","Sa",{"$f":"IF(OR(E39=\"F\",F39=\"U\",F39=\"AU\"),'meine Daten'!$C$12,IF(C39=\"Mo\",'meine Daten'!$H$21,IF(C39=\"Di\",'meine Daten'!$H$22,IF(C39=\"Mi\",'meine Daten'!$H$23,IF(C39=\"Do\",'meine Daten'!$H$24,IF(C39=\"Fr\",'meine Daten'!$H$25,IF(C39=\"Sa\",'meine Daten'!$H$26,IF(C39=\"So\",'meine Daten'!$H$27))))))))","v":"00:00:00"},"",null,null,null,"00:00:00",null,null,null,null,"00:00:00","00:00:00",null," ",{"$f":"IF(ISERROR(VLOOKUP(B39,Feiertage!$B$5:$B$21,1,FALSE)),WEEKDAY(B39,2),\"Feiertag\")","v":6},{"$f":"S38+IF(F39=\"Z\",-(#REF!*24),IF(G39=\"\",0,(O39+P39-D39)*24))","v":0},null,null,"dass unrichtige Angaben eine grobe Pflichtverletzung darstellen. "]
[null,"2023-07-30","So",{"$f":"IF(OR(E40=\"F\",F40=\"U\",F40=\"AU\"),'meine Daten'!$C$12,IF(C40=\"Mo\",'meine Daten'!$H$21,IF(C40=\"Di\",'meine Daten'!$H$22,IF(C40=\"Mi\",'meine Daten'!$H$23,IF(C40=\"Do\",'meine Daten'!$H$24,IF(C40=\"Fr\",'meine Daten'!$H$25,IF(C40=\"Sa\",'meine Daten'!$H$26,IF(C40=\"So\",'meine Daten'!$H$27))))))))","v":"00:00:00"},"",null,null,null,"00:00:00",null,null,null,null,"00:00:00","00:00:00",null," ",{"$f":"IF(ISERROR(VLOOKUP(B40,Feiertage!$B$5:$B$21,1,FALSE)),WEEKDAY(B40,2),\"Feiertag\")","v":7},{"$f":"S39+IF(F40=\"Z\",-(#REF!*24),IF(G40=\"\",0,(O40+P40-D40)*24))","v":0}]
[null,"2023-07-31","Mo",{"$f":"IF(OR(E41=\"F\",F41=\"U\",F41=\"AU\"),'meine Daten'!$C$12,IF(C41=\"Mo\",'meine Daten'!$H$21,IF(C41=\"Di\",'meine Daten'!$H$22,IF(C41=\"Mi\",'meine Daten'!$H$23,IF(C41=\"Do\",'meine Daten'!$H$24,IF(C41=\"Fr\",'meine Daten'!$H$25,IF(C41=\"Sa\",'meine Daten'!$H$26,IF(C41=\"So\",'meine Daten'!$H$27))))))))","v":"08:00:00"},null,null,null,null,"00:00:00",null,null,null,null,"00:00:00","00:00:00",null," ",{"$f":"IF(ISERROR(VLOOKUP(B41,Feiertage!$B$5:$B$21,1,FALSE)),WEEKDAY(B41,2),\"Feiertag\")","v":1},{"$f":"S40+IF(F41=\"Z\",-(#REF!*24),IF(G41=\"\",0,(O41+P41-D41)*24))","v":0}]
[null,null,null,null,null,{"$f":"COUNTIF(F13:F41,\"U\")+COUNTIF(F13:F41,\"Z\")+COUNTIF(F13:F41,AU)","v":0},{"$f":"IF(SUM(G13:G41)<=0,0,1)","v":0},null,null,null,null,null,null,null,null,null,{"$f":"SUM(Q11:Q41)","v":0}]
[null,null,null,null,null,null,null,null,null,null,null,null,null,"Monatssaldo:",null,null,{"$f":"IF(F42+G42=0,\"\",SUM(Q11:Q41))","v":""}]
[null,null,null,null,null,null,null,null,null,null,null,null,null,"Gleitzeitkontostand:",null,null,{"$f":"IF(OR(Q10=\"\",Q43=\"\"),\"\",Q10+Q43)","v":""},null,null,null,null,"Datum, Unterschrift"]
[null,null,null,null,null,null,null,null,null,null,null,null,null,"(In Stunden:Minuten)"]
[null,null,null,null,null,null,null,null,null,null,null,null,null,null,null,null,null,null,null,null,null,null,"„Der Arbeitszeit-Checker“ von Simone Back für www.arbeitszeit-klug-gestalten.de "]
[null,null,null,null,null,null,null,null,null,null,null,null,null,"Urlaubstage",null,null,{"$f":"COUNTIF(F11:F41,\"U\")","v":0}]
[null,null,null,null,null,null,null,null,null,null,null,null,null,null,null,null,null,null,null,null,null,null,"ist lizensiert unter einer Creative Commons Lizenz CC BY SA 4.0 \n(Nutzung bei Namensnennung, Weitergabe unter gleichen Bedingungen)\n"]
[null,null,null,null,null,null,null,null,null,null,null,null,null,null,null,null,null,null,null,null,null,"Copyright für das Logo \"Arbeitszeit klug gestalten\": RKW Hessen. Das Logo darf nur für den Checker in der Ursprungsform genutzt werden."]

{"sheet":"Aug","index":9,"n_rows":49,"n_cols":23,"rows_kept":49,"cut":false,"hidden":false,"merged":[[48,21,48,25],[45,22,46,25],[9,1,9,15],[47,1,47,2],[3,15,3,16],[6,1,8,1],[6,2,8,2],[6,3,8,3],[6,4,8,4],[6,5,8,5],[6,15,7,15],[7,9,7,10],[7,11,7,12],[47,22,47,25]]}
[null,"Arbeitszeit-Nachweis",null,null,null,null,null,"Name:",null,{"$f":"IF('meine Daten'!C3=\"\",\"\",'meine Daten'!C3)","v":""},null,null,null,null,null,null,null,null,{"$f":"B11","v":"2023-08-01"},{"$f":"B11","v":"2023-08-01"}]
[]
[null,null,null,null,"Symbol* :  ","U","=Urlaub"]
[null,null,null,null,null,"AU","=Krank/Kur",null,null,null,null,null,null,null,"bedeutet:","Eintrag fehlt "]
[null,null,null,null,null,"Z","Zeitausgleich (ganzer Tag)",null,null,null,null,null,null,null,"bedeutet:","mehr als 10 Stunden"]
[]
[null,"Datum","Tag","Sollzeit","Feiertag","Symbol *","Brutto-Arbeitszeit",null,null,"Pausen",null,null,null,null,"Netto","weitere\nReisezeit","Saldo"]
[null,null,null,null,null,null,null,null,null,"Mittag",null,"weitere\n(Std:Min)",null,"Summe","Arbeits-\nzeit",null,"Arbeits-\nzeit"]
[null,null,null,null,null,null,"von","bis","Std:Min","von","bis","I","II","./.Std:Min","Std:Min","Std:Min","Std:Min",null,null,"Bemerkung"]
[null,"Übertrag vom Vormonat: ",null,null,null,null,null,null,null,null,null,null,null,null,null,null,{"$f":"Juli!Q44","v":""}]
[null,{"$f":"Juli!B41+1","v":"2023-08-01"},{"$f":"TEXT(B11,\"TTT\")","v":"Di"},{"$f":"IF(OR(E11=\"F\",F11=\"U\",F11=\"AU\"),'meine Daten'!$C$12,IF(C11=\"Mo\",'meine Daten'!$H$29,IF(C11=\"Di\",'meine Daten'!$H$30,IF(C11=\"Mi\",'meine Daten'!$H$31,IF(C11=\"Do\",'meine Daten'!$H$32,IF(C11=\"Fr\",'meine Daten'!$H$33,IF(C11=\"Sa\",'meine Daten'!$H$34,IF(C11=\"So\",'meine Daten'!$H$35))))))))","v":"08:00:00"},{"$f":"IF(R11=\"Feiertag\",\"F\",\"\")","v":""},null,null,null,{"$f":"H11-G11","v":"00:00:00"},null,null,null,null,{"$f":"K11-J11+L11+M11","v":"00:00:00"},{"$f":"I11-N11","v":"00:00:00"},null,{"$f":"IF(F11=\"Z\",-(D11),IF(G11=\"\",\" \",IF(O11+P11>D11,O11+P11-D11,IF(O11+P11<D11,-(D11-O11-P11),\" \"))))","v":" "},{"$f":"IF(ISERROR(VLOOKUP(B11,Feiertage!$B$5:$B$21,1,FALSE)),WEEKDAY(B11,2),\"Feiertag\")","v":2},{"$f":"IF(G11=\"\",0,(O11+P11-D11)*24)","v":0}]
[null,{"$f":"B11+1","v":"2023-08-02"},{"$f":"TEXT(B12,\"TTT\")","v":"Mi"},{"$f":"IF(OR(E12=\"F\",F12=\"U\",F12=\"AU\"),'meine Daten'!$C$12,IF(C12=\"Mo\",'meine Daten'!$H$29,IF(C12=\"Di\",'meine Daten'!$H$30,IF(C12=\"Mi\",'meine Daten'!$H$31,IF(C12=\"Do\",'meine Daten'!$H$32,IF(C12=\"Fr\",'meine Daten'!$H$33,IF(C12=\"Sa\",'meine Daten'!$H$34,IF(C12=\"So\",'meine Daten'!$H$35))))))))","v":"08:00:00"},"",null,null,null,{"$f":"H12-G12","v":"00:00:00"},null,null,null,null,{"$f":"K12-J12+L12+M12","v":"00:00:00"},"00:00:00",null,{"$f":"IF(F12=\"Z\",-(D12),IF(G12=\"\",\" \",IF(O12+P12>D12,O12+P12-D12,IF(O12+P12<D12,-(D12-O12-P12),\" \"))))","v":" "},{"$f":"IF(ISERROR(VLOOKUP(B12,Feiertage!$B$5:$B$21,1,FALSE)),WEEKDAY(B12,2),\"Feiertag\")","v":3},{"$f":"S11+IF(F12=\"Z\",-(#REF!*24),IF(G12=\"\",0,(O12+P12-D12)*24))","v":0}]
[null,{"$f":"B12+1","v":"2023-08-03"},"Do",{"$f":"IF(OR(E13=\"F\",F13=\"U\",F13=\"AU\"),'meine Daten'!$C$12,IF(C13=\"Mo\",'meine Daten'!$H$29,IF(C13=\"Di\",'meine Daten'!$H$30,IF(C13=\"Mi\",'meine Daten'!$H$31,IF(C13=\"Do\",'meine Daten'!$H$32,IF(C13=\"Fr\",'meine Daten'!$H$33,IF(C13=\"Sa\",'meine Daten'!$H$34,IF(C13=\"So\",'meine Daten'!$H$35))))))))","v":"08:00:00"},"",null,null,null,{"$f":"H13-G13","v":"00:00:00"},null,null,null,null,"00:00:00","00:00:00",null," ",{"$f":"IF(ISERROR(VLOOKUP(B13,Feiertage!$B$5:$B$21,1,FALSE)),WEEKDAY(B13,2),\"Feiertag\")","v":4},{"$f":"S12+IF(F13=\"Z\",-(#REF!*24),IF(G13=\"\",0,(O13+P13-D13)*24))","v":0}]
[null,"2023-08-04","Fr",{"$f":"IF(OR(E14=\"F\",F14=\"U\",F14=\"AU\"),'meine Daten'!$C$12,IF(C14=\"Mo\",'meine Daten'!$H$29,IF(C14=\"Di\",'meine Daten'!$H$30,IF(C14=\"Mi\",'meine Daten'!$H$31,IF(C14=\"Do\",'meine Daten'!$H$32,IF(C14=\"Fr\",'meine Daten'!$H$33,IF(C14=\"Sa\",'meine Daten'!$H$34,IF(C14=\"So\",'meine Daten'!$H$35))))))))","v":"08:00:00"},"",null,null,null,"00:00:00",null,null,null,null,"00:00:00","00:00:00",null," ",{"$f":"IF(ISERROR(VLOOKUP(B14,Feiertage!$B$5:$B$21,1,FALSE)),WEEKDAY(B14,2),\"Feiertag\")","v":5},{"$f":"S13+IF(F14=\"Z\",-(#REF!*24),IF(G14=\"\",0,(O14+P14-D14)*24))","v":0}]
[null,"2023-08-05","Sa",{"$f":"IF(OR(E15=\"F\",F15=\"U\",F15=\"AU\"),'meine Daten'!$C$12,IF(C15=\"Mo\",'meine Daten'!$H$29,IF(C15=\"Di\",'meine Daten'!$H$30,IF(C15=\"Mi\",'meine Daten'!$H$31,IF(C15=\"Do\",'meine Daten'!$H$32,IF(C15=\"Fr\",'meine Daten'!$H$33,IF(C15=\"Sa\",'meine Daten'!$H$34,IF(C15=\"So\",'meine Daten'!$H$35))))))))","v":"00:00:00"},"",null,null,null,"00:00:00",null,null,null,null,"00:00:00","00:00:00",null," ",{"$f":"IF(ISERROR(VLOOKUP(B15,Feiertage!$B$5:$B$21,1,FALSE)),WEEKDAY(B15,2),\"Feiertag\")","v":6},{"$f":"S14+IF(F15=\"Z\",-(#REF!*24),IF(G15=\"\",0,(O15+P15-D15)*24))","v":0}]
[null,"2023-08-06","So",{"$f":"IF(OR(E16=\"F\",F16=\"U\",F16=\"AU\"),'meine Daten'!$C$12,IF(C16=\"Mo\",'meine Daten'!$H$29,IF(C16=\"Di\",'meine Daten'!$H$30,IF(C16=\"Mi\",'meine Daten'!$H$31,IF(C16=\"Do\",'meine Daten'!$H$32,IF(C16=\"Fr\",'meine Daten'!$H$33,IF(C16=\"Sa\",'meine Daten'!$H$34,IF(C16=\"So\",'meine Daten'!$H$35))))))))","v":"00:00:00"},"",null,null,null,"00:00:00",null,null,null,null,"00:00:00","00:00:00",null," ",{"$f":"IF(ISERROR(VLOOKUP(B16,Feiertage!$B$5:$B$21,1,FALSE)),WEEKDAY(B16,2),\"Feiertag\")","v":7},{"$f":"S15+IF(F16=\"Z\",-(#REF!*24),IF(G16=\"\",0,(O16+P16-D16)*24))","v":0}]
[null,"2023-08-07","Mo",{"$f":"IF(OR(E17=\"F\",F17=\"U\",F17=\"AU\"),'meine Daten'!$C$12,IF(C17=\"Mo\",'meine Daten'!$H$29,IF(C17=\"Di\",'meine Daten'!$H$30,IF(C17=\"Mi\",'meine Daten'!$H$31,IF(C17=\"Do\",'meine Daten'!$H$32,IF(C17=\"Fr\",'meine Daten'!$H$33,IF(C17=\"Sa\",'meine Daten'!$H$34,IF(C17=\"So\",'meine Daten'!$H$35))))))))","v":"08:00:00"},"",null,null,null,"00:00:00",null,null,null,null,"00:00:00","00:00:00",null," ",{"$f":"IF(ISERROR(VLOOKUP(B17,Feiertage!$B$5:$B$21,1,FALSE)),WEEKDAY(B17,2),\"Feiertag\")","v":1},{"$f":"S16+IF(F17=\"Z\",-(#REF!*24),IF(G17=\"\",0,(O17+P17-D17)*24))","v":0}]
[null,"2023-08-08","Di",{"$f":"IF(OR(E18=\"F\",F18=\"U\",F18=\"AU\"),'meine Daten'!$C$12,IF(C18=\"Mo\",'meine Daten'!$H$29,IF(C18=\"Di\",'meine Daten'!$H$30,IF(C18=\"Mi\",'meine Daten'!$H$31,IF(C18=\"Do\",'meine Daten'!$H$32,IF(C18=\"Fr\",'meine Daten'!$H$33,IF(C18=\"Sa\",'meine Daten'!$H$34,IF(C18=\"So\",'meine Daten'!$H$35))))))))","v":"08:00:00"},"",null,null,null,"00:00:00",null,null,null,null,"00:00:00","00:00:00",null," ",{"$f":"IF(ISERROR(VLOOKUP(B18,Feiertage!$B$5:$B$21,1,FALSE)),WEEKDAY(B18,2),\"Feiertag\")","v":2},{"$f":"S17+IF(F18=\"Z\",-(#REF!*24),IF(G18=\"\",0,(O18+P18-D18)*24))","v":0}]
[null,"2023-08-09","Mi",{"$f":"IF(OR(E19=\"F\",F19=\"U\",F19=\"AU\"),'meine Daten'!$C$12,IF(C19=\"Mo\",'meine Daten'!$H$29,IF(C19=\"Di\",'meine Daten'!$H$30,IF(C19=\"Mi\",'meine Daten'!$H$31,IF(C19=\"Do\",'meine Daten'!$H$32,IF(C19=\"Fr\",'meine Daten'!$H$33,IF(C19=\"Sa\",'meine Daten'!$H$34,IF(C19=\"So\",'meine Daten'!$H$35))))))))","v":"08:00:00"},"",null,null,null,"00:00:00",null,null,null,null,"00:00:00","00:00:00",null," ",{"$f":"IF(ISERROR(VLOOKUP(B19,Feiertage!$B$5:$B$21,1,FALSE)),WEEKDAY(B19,2),\"Feiertag\")","v":3},{"$f":"S18+IF(F19=\"Z\",-(#REF!*24),IF(G19=\"\",0,(O19+P19-D19)*24))","v":0}]
[null,"2023-08-10","Do",{"$f":"IF(OR(E20=\"F\",F20=\"U\",F20=\"AU\"),'meine Daten'!$C$12,IF(C20=\"Mo\",'meine Daten'!$H$29,IF(C20=\"Di\",'meine Daten'!$H$30,IF(C20=\"Mi\",'meine Daten'!$H$31,IF(C20=\"Do\",'meine Daten'!$H$32,IF(C20=\"Fr\",'meine Daten'!$H$33,IF(C20=\"Sa\",'meine Daten'!$H$34,IF(C20=\"So\",'meine Daten'!$H$35))))))))","v":"08:00:00"},"",null,null,null,"00:00:00",null,null,null,null,"00:00:00","00:00:00",null," ",{"$f":"IF(ISERROR(VLOOKUP(B20,Feiertage!$B$5:$B$21,1,FALSE)),WEEKDAY(B20,2),\"Feiertag\")","v":4},{"$f":"S19+IF(F20=\"Z\",-(#REF!*24),IF(G20=\"\",0,(O20+P20-D20)*24))","v":0}]
[null,"2023-08-11","Fr",{"$f":"IF(OR(E21=\"F\",F21=\"U\",F21=\"AU\"),'meine Daten'!$C$12,IF(C21=\"Mo\",'meine Daten'!$H$29,IF(C21=\"Di\",'meine Daten'!$H$30,IF(C21=\"Mi\",'meine Daten'!$H$31,IF(C21=\"Do\",'meine Daten'!$H$32,IF(C21=\"Fr\",'meine Daten'!$H$33,IF(C21=\"Sa\",'meine Daten'!$H$34,IF(C21=\"So\",'meine Daten'!$H$35))))))))","v":"08:00:00"},"",null,null,null,"00:00:00",null,null,null,null,"00:00:00","00:00:00",null," ",{"$f":"IF(ISERROR(VLOOKUP(B21,Feiertage!$B$5:$B$21,1,FALSE)),WEEKDAY(B21,2),\"Feiertag\")","v":5},{"$f":"S20+IF(F21=\"Z\",-(#REF!*24),IF(G21=\"\",0,(O21+P21-D21)*24))","v":0}]
[null,"2023-08-12","Sa",{"$f":"IF(OR(E22=\"F\",F22=\"U\",F22=\"AU\"),'meine Daten'!$C$12,IF(C22=\"Mo\",'meine Daten'!$H$29,IF(C22=\"Di\",'meine Daten'!$H$30,IF(C22=\"Mi\",'meine Daten'!$H$31,IF(C22=\"Do\",'meine Daten'!$H$32,IF(C22=\"Fr\",'meine Daten'!$H$33,IF(C22=\"Sa\",'meine Daten'!$H$34,IF(C22=\"So\",'meine Daten'!$H$35))))))))","v":"00:00:00"},"",null,null,null,"00:00:00",null,null,null,null,"00:00:00","00:00:00",null," ",{"$f":"IF(ISERROR(VLOOKUP(B22,Feiertage!$B$5:$B$21,1,FALSE)),WEEKDAY(B22,2),\"Feiertag\")","v":6},{"$f":"S21+IF(F22=\"Z\",-(#REF!*24),IF(G22=\"\",0,(O22+P22-D22)*24))","v":0}]
[null,"2023-08-13","So",{"$f":"IF(OR(E23=\"F\",F23=\"U\",F23=\"AU\"),'meine Daten'!$C$12,IF(C23=\"Mo\",'meine Daten'!$H$29,IF(C23=\"Di\",'meine Daten'!$H$30,IF(C23=\"Mi\",'meine Daten'!$H$31,IF(C23=\"Do\",'meine Daten'!$H$32,IF(C23=\"Fr\",'meine Daten'!$H$33,IF(C23=\"Sa\",'meine Daten'!$H$34,IF(C23=\"So\",'meine Daten'!$H$35))))))))","v":"00:00:00"},"",null,null,null,"00:00:00",null,null,null,null,"00:00:00","00:00:00",null," ",{"$f":"IF(ISERROR(VLOOKUP(B23,Feiertage!$B$5:$B$21,1,FALSE)),WEEKDAY(B23,2),\"Feiertag\")","v":7},{"$f":"S22+IF(F23=\"Z\",-(#REF!*24),IF(G23=\"\",0,(O23+P23-D23)*24))","v":0}]
[null,"2023-08-14","Mo",{"$f":"IF(OR(E24=\"F\",F24=\"U\",F24=\"AU\"),'meine Daten'!$C$12,IF(C24=\"Mo\",'meine Daten'!$H$29,IF(C24=\"Di\",'meine Daten'!$H$30,IF(C24=\"Mi\",'meine Daten'!$H$31,IF(C24=\"Do\",'meine Daten'!$H$32,IF(C24=\"Fr\",'meine Daten'!$H$33,IF(C24=\"Sa\",'meine Daten'!$H$34,IF(C24=\"So\",'meine Daten'!$H$35))))))))","v":"08:00:00"},"",null,null,null,"00:00:00",null,null,null,null,"00:00:00","00:00:00",null," ",{"$f":"IF(ISERROR(VLOOKUP(B24,Feiertage!$B$5:$B$21,1,FALSE)),WEEKDAY(B24,2),\"Feiertag\")","v":1},{"$f":"S23+IF(F24=\"Z\",-(#REF!*24),IF(G24=\"\",0,(O24+P24-D24)*24))","v":0}]
[null,"2023-08-15","Di",{"$f":"IF(OR(E25=\"F\",F25=\"U\",F25=\"AU\"),'meine Daten'!$C$12,IF(C25=\"Mo\",'meine Daten'!$H$29,IF(C25=\"Di\",'meine Daten'!$H$30,IF(C25=\"Mi\",'meine Daten'!$H$31,IF(C25=\"Do\",'meine Daten'!$H$32,IF(C25=\"Fr\",'meine Daten'!$H$33,IF(C25=\"Sa\",'meine Daten'!$H$34,IF(C25=\"So\",'meine Daten'!$H$35))))))))","v":"08:00:00"},"",null,null,null,"00:00:00",null,null,null,null,"00:00:00","00:00:00",null," ",{"$f":"IF(ISERROR(VLOOKUP(B25,Feiertage!$B$5:$B$21,1,FALSE)),WEEKDAY(B25,2),\"Feiertag\")","v":2},{"$f":"S24+IF(F25=\"Z\",-(#REF!*24),IF(G25=\"\",0,(O25+P25-D25)*24))","v":0}]
[null,"2023-08-16","Mi",{"$f":"IF(OR(E26=\"F\",F26=\"U\",F26=\"AU\"),'meine Daten'!$C$12,IF(C26=\"Mo\",'meine Daten'!$H$29,IF(C26=\"Di\",'meine Daten'!$H$30,IF(C26=\"Mi\",'meine Daten'!$H$31,IF(C26=\"Do\",'meine Daten'!$H$32,IF(C26=\"Fr\",'meine Daten'!$H$33,IF(C26=\"Sa\",'meine Daten'!$H$34,IF(C26=\"So\",'meine Daten'!$H$35))))))))","v":"08:00:00"},"",null,null,null,"00:00:00",null,null,null,null,"00:00:00","00:00:00",null," ",{"$f":"IF(ISERROR(VLOOKUP(B26,Feiertage!$B$5:$B$21,1,FALSE)),WEEKDAY(B26,2),\"Feiertag\")","v":3},{"$f":"S25+IF(F26=\"Z\",-(#REF!*24),IF(G26=\"\",0,(O26+P26-D26)*24))","v":0}]
[null,"2023-08-17","Do",{"$f":"IF(OR(E27=\"F\",F27=\"U\",F27=\"AU\"),'meine Daten'!$C$12,IF(C27=\"Mo\",'meine Daten'!$H$29,IF(C27=\"Di\",'meine Daten'!$H$30,IF(C27=\"Mi\",'meine Daten'!$H$31,IF(C27=\"Do\",'meine Daten'!$H$32,IF(C27=\"Fr\",'meine Daten'!$H$33,IF(C27=\"Sa\",'meine Daten'!$H$34,IF(C27=\"So\",'meine Daten'!$H$35))))))))","v":"08:00:00"},"",null,null,null,"00:00:00",null,null,null,null,"00:00:00","00:00:00",null," ",{"$f":"IF(ISERROR(VLOOKUP(B27,Feiertage!$B$5:$B$21,1,FALSE)),WEEKDAY(B27,2),\"Feiertag\")","v":4},{"$f":"S26+IF(F27=\"Z\",-(#REF!*24),IF(G27=\"\",0,(O27+P27-D27)*24))","v":0}]
[null,"2023-08-18","Fr",{"$f":"IF(OR(E28=\"F\",F28=\"U\",F28=\"AU\"),'meine Daten'!$C$12,IF(C28=\"Mo\",'meine Daten'!$H$29,IF(C28=\"Di\",'meine Daten'!$H$30,IF(C28=\"Mi\",'meine Daten'!$H$31,IF(C28=\"Do\",'meine Daten'!$H$32,IF(C28=\"Fr\",'meine Daten'!$H$33,IF(C28=\"Sa\",'meine Daten'!$H$34,IF(C28=\"So\",'meine Daten'!$H$35))))))))","v":"08:00:00"},"",null,null,null,"00:00:00",null,null,null,null,"00:00:00","00:00:00",null," ",{"$f":"IF(ISERROR(VLOOKUP(B28,Feiertage!$B$5:$B$21,1,FALSE)),WEEKDAY(B28,2),\"Feiertag\")","v":5},{"$f":"S27+IF(F28=\"Z\",-(#REF!*24),IF(G28=\"\",0,(O28+P28-D28)*24))","v":0}]
[null,"2023-08-19","Sa",{"$f":"IF(OR(E29=\"F\",F29=\"U\",F29=\"AU\"),'meine Daten'!$C$12,IF(C29=\"Mo\",'meine Daten'!$H$29,IF(C29=\"Di\",'meine Daten'!$H$30,IF(C29=\"Mi\",'meine Daten'!$H$31,IF(C29=\"Do\",'meine Daten'!$H$32,IF(C29=\"Fr\",'meine Daten'!$H$33,IF(C29=\"Sa\",'meine Daten'!$H$34,IF(C29=\"So\",'meine Daten'!$H$35))))))))","v":"00:00:00"},"",null,null,null,"00:00:00",null,null,null,null,"00:00:00","00:00:00",null," ",{"$f":"IF(ISERROR(VLOOKUP(B29,Feiertage!$B$5:$B$21,1,FALSE)),WEEKDAY(B29,2),\"Feiertag\")","v":6},{"$f":"S28+IF(F29=\"Z\",-(#REF!*24),IF(G29=\"\",0,(O29+P29-D29)*24))","v":0}]
[null,"2023-08-20","So",{"$f":"IF(OR(E30=\"F\",F30=\"U\",F30=\"AU\"),'meine Daten'!$C$12,IF(C30=\"Mo\",'meine Daten'!$H$29,IF(C30=\"Di\",'meine Daten'!$H$30,IF(C30=\"Mi\",'meine Daten'!$H$31,IF(C30=\"Do\",'meine Daten'!$H$32,IF(C30=\"Fr\",'meine Daten'!$H$33,IF(C30=\"Sa\",'meine Daten'!$H$34,IF(C30=\"So\",'meine Daten'!$H$35))))))))","v":"00:00:00"},"",null,null,null,"00:00:00",null,null,null,null,"00:00:00","00:00:00",null," ",{"$f":"IF(ISERROR(VLOOKUP(B30,Feiertage!$B$5:$B$21,1,FALSE)),WEEKDAY(B30,2),\"Feiertag\")","v":7},{"$f":"S29+IF(F30=\"Z\",-(#REF!*24),IF(G30=\"\",0,(O30+P30-D30)*24))","v":0}]
[null,"2023-08-21","Mo",{"$f":"IF(OR(E31=\"F\",F31=\"U\",F31=\"AU\"),'meine Daten'!$C$12,IF(C31=\"Mo\",'meine Daten'!$H$29,IF(C31=\"Di\",'meine Daten'!$H$30,IF(C31=\"Mi\",'meine Daten'!$H$31,IF(C31=\"Do\",'meine Daten'!$H$32,IF(C31=\"Fr\",'meine Daten'!$H$33,IF(C31=\"Sa\",'meine Daten'!$H$34,IF(C31=\"So\",'meine Daten'!$H$35))))))))","v":"08:00:00"},"",null,null,null,"00:00:00",null,null,null,null,"00:00:00","00:00:00",null," ",{"$f":"IF(ISERROR(VLOOKUP(B31,Feiertage!$B$5:$B$21,1,FALSE)),WEEKDAY(B31,2),\"Feiertag\")","v":1},{"$f":"S30+IF(F31=\"Z\",-(#REF!*24),IF(G31=\"\",0,(O31+P31-D31)*24))","v":0}]
[null,"2023-08-22","Di",{"$f":"IF(OR(E32=\"F\",F32=\"U\",F32=\"AU\"),'meine Daten'!$C$12,IF(C32=\"Mo\",'meine Daten'!$H$29,IF(C32=\"Di\",'meine Daten'!$H$30,IF(C32=\"Mi\",'meine Daten'!$H$31,IF(C32=\"Do\",'meine Daten'!$H$32,IF(C32=\"Fr\",'meine Daten'!$H$33,IF(C32=\"Sa\",'meine Daten'!$H$34,IF(C32=\"So\",'meine Daten'!$H$35))))))))","v":"08:00:00"},"",null,null,null,"00:00:00",null,null,null,null,"00:00:00","00:00:00",null," ",{"$f":"IF(ISERROR(VLOOKUP(B32,Feiertage!$B$5:$B$21,1,FALSE)),WEEKDAY(B32,2),\"Feiertag\")","v":2},{"$f":"S31+IF(F32=\"Z\",-(#REF!*24),IF(G32=\"\",0,(O32+P32-D32)*24))","v":0}]
[null,"2023-08-23","Mi",{"$f":"IF(OR(E33=\"F\",F33=\"U\",F33=\"AU\"),'meine Daten'!$C$12,IF(C33=\"Mo\",'meine Daten'!$H$29,IF(C33=\"Di\",'meine Daten'!$H$30,IF(C33=\"Mi\",'meine Daten'!$H$31,IF(C33=\"Do\",'meine Daten'!$H$32,IF(C33=\"Fr\",'meine Daten'!$H$33,IF(C33=\"Sa\",'meine Daten'!$H$34,IF(C33=\"So\",'meine Daten'!$H$35))))))))","v":"08:00:00"},"",null,null,null,"00:00:00",null,null,null,null,"00:00:00","00:00:00",null," ",{"$f":"IF(ISERROR(VLOOKUP(B33,Feiertage!$B$5:$B$21,1,FALSE)),WEEKDAY(B33,2),\"Feiertag\")","v":3},{"$f":"S32+IF(F33=\"Z\",-(#REF!*24),IF(G33=\"\",0,(O33+P33-D33)*24))","v":0}]
[null,"2023-08-24","Do",{"$f":"IF(OR(E34=\"F\",F34=\"U\",F34=\"AU\"),'meine Daten'!$C$12,IF(C34=\"Mo\",'meine Daten'!$H$29,IF(C34=\"Di\",'meine Daten'!$H$30,IF(C34=\"Mi\",'meine Daten'!$H$31,IF(C34=\"Do\",'meine Daten'!$H$32,IF(C34=\"Fr\",'meine Daten'!$H$33,IF(C34=\"Sa\",'meine Daten'!$H$34,IF(C34=\"So\",'meine Daten'!$H$35))))))))","v":"08:00:00"},"",null,null,null,"00:00:00",null,null,null,null,"00:00:00","00:00:00",null," ",{"$f":"IF(ISERROR(VLOOKUP(B34,Feiertage!$B$5:$B$21,1,FALSE)),WEEKDAY(B34,2),\"Feiertag\")","v":4},{"$f":"S33+IF(F34=\"Z\",-(#REF!*24),IF(G34=\"\",0,(O34+P34-D34)*24))","v":0}]
[null,"2023-08-25","Fr",{"$f":"IF(OR(E35=\"F\",F35=\"U\",F35=\"AU\"),'meine Daten'!$C$12,IF(C35=\"Mo\",'meine Daten'!$H$29,IF(C35=\"Di\",'meine Daten'!$H$30,IF(C35=\"Mi\",'meine Daten'!$H$31,IF(C35=\"Do\",'meine Daten'!$H$32,IF(C35=\"Fr\",'meine Daten'!$H$33,IF(C35=\"Sa\",'meine Daten'!$H$34,IF(C35=\"So\",'meine Daten'!$H$35))))))))","v":"08:00:00"},"",null,null,null,"00:00:00",null,null,null,null,"00:00:00","00:00:00",null," ",{"$f":"IF(ISERROR(VLOOKUP(B35,Feiertage!$B$5:$B$21,1,FALSE)),WEEKDAY(B35,2),\"Feiertag\")","v":5},{"$f":"S34+IF(F35=\"Z\",-(#REF!*24),IF(G35=\"\",0,(O35+P35-D35)*24))","v":0}]
[null,"2023-08-26","Sa",{"$f":"IF(OR(E36=\"F\",F36=\"U\",F36=\"AU\"),'meine Daten'!$C$12,IF(C36=\"Mo\",'meine Daten'!$H$29,IF(C36=\"Di\",'meine Daten'!$H$30,IF(C36=\"Mi\",'meine Daten'!$H$31,IF(C36=\"Do\",'meine Daten'!$H$32,IF(C36=\"Fr\",'meine Daten'!$H$33,IF(C36=\"Sa\",'meine Daten'!$H$34,IF(C36=\"So\",'meine Daten'!$H$35))))))))","v":"00:00:00"},"",null,null,null,"00:00:00",null,null,null,null,"00:00:00","00:00:00",null," ",{"$f":"IF(ISERROR(VLOOKUP(B36,Feiertage!$B$5:$B$21,1,FALSE)),WEEKDAY(B36,2),\"Feiertag\")","v":6},{"$f":"S35+IF(F36=\"Z\",-(#REF!*24),IF(G36=\"\",0,(O36+P36-D36)*24))","v":0}]
[null,"2023-08-27","So",{"$f":"IF(OR(E37=\"F\",F37=\"U\",F37=\"AU\"),'meine Daten'!$C$12,IF(C37=\"Mo\",'meine Daten'!$H$29,IF(C37=\"Di\",'meine Daten'!$H$30,IF(C37=\"Mi\",'meine Daten'!$H$31,IF(C37=\"Do\",'meine Daten'!$H$32,IF(C37=\"Fr\",'meine Daten'!$H$33,IF(C37=\"Sa\",'meine Daten'!$H$34,IF(C37=\"So\",'meine Daten'!$H$35))))))))","v":"00:00:00"},"",null,null,null,"00:00:00",null,null,null,null,"00:00:00","00:00:00",null," ",{"$f":"IF(ISERROR(VLOOKUP(B37,Feiertage!$B$5:$B$21,1,FALSE)),WEEKDAY(B37,2),\"Feiertag\")","v":7},{"$f":"S36+IF(F37=\"Z\",-(#REF!*24),IF(G37=\"\",0,(O37+P37-D37)*24))","v":0}]
[null,"2023-08-28","Mo",{"$f":"IF(OR(E38=\"F\",F38=\"U\",F38=\"AU\"),'meine Daten'!$C$12,IF(C38=\"Mo\",'meine Daten'!$H$29,IF(C38=\"Di\",'meine Daten'!$H$30,IF(C38=\"Mi\",'meine Daten'!$H$31,IF(C38=\"Do\",'meine Daten'!$H$32,IF(C38=\"Fr\",'meine Daten'!$H$33,IF(C38=\"Sa\",'meine Daten'!$H$34,IF(C38=\"So\",'meine Daten'!$H$35))))))))","v":"08:00:00"},"",null,null,null,"00:00:00",null,null,null,null,"00:00:00","00:00:00",null," ",{"$f":"IF(ISERROR(VLOOKUP(B38,Feiertage!$B$5:$B$21,1,FALSE)),WEEKDAY(B38,2),\"Feiertag\")","v":1},{"$f":"S37+IF(F38=\"Z\",-(#REF!*24),IF(G38=\"\",0,(O38+P38-D38)*24))","v":0},null,null,"Ich versichere die Richtigkeit meiner Angaben. Mir ist bekannt, "]
[null,"2023-08-29","Di",{"$f":"IF(OR(E39=\"F\",F39=\"U\",F39=\"AU\"),'meine Daten'!$C$12,IF(C39=\"Mo\",'meine Daten'!$H$29,IF(C39=\"Di\",'meine Daten'!$H$30,IF(C39=\"Mi\",'meine Daten'!$H$31,IF(C39=\"Do\",'meine Daten'!$H$32,IF(C39=\"Fr\",'meine Daten'!$H$33,IF(C39=\"Sa\",'meine Daten'!$H$34,IF(C39=\"So\",'meine Daten'!$H$35))))))))","v":"08:00:00"},"",null,null,null,"00:00:00",null,null,null,null,"00:00:00","00:00:00",null," ",{"$f":"IF(ISERROR(VLOOKUP(B39,Feiertage!$B$5:$B$21,1,FALSE)),WEEKDAY(B39,2),\"Feiertag\")","v":2},{"$f":"S38+IF(F39=\"Z\",-(#REF!*24),IF(G39=\"\",0,(O39+P39-D39)*24))","v":0},null,null,"dass unrichtige Angaben eine grobe Pflichtverletzung darstellen. "]
[null,"2023-08-30","Mi",{"$f":"IF(OR(E40=\"F\",F40=\"U\",F40=\"AU\"),'meine Daten'!$C$12,IF(C40=\"Mo\",'meine Daten'!$H$29,IF(C40=\"Di\",'meine Daten'!$H$30,IF(C40=\"Mi\",'meine Daten'!$H$31,IF(C40=\"Do\",'meine Daten'!$H$32,IF(C40=\"Fr\",'meine Daten'!$H$33,IF(C40=\"Sa\",'meine Daten'!$H$34,IF(C40=\"So\",'meine Daten'!$H$35))))))))","v":"08:00:00"},"",null,null,null,"00:00:00",null,null,null,null,"00:00:00","00:00:00",null," ",{"$f":"IF(ISERROR(VLOOKUP(B40,Feiertage!$B$5:$B$21,1,FALSE)),WEEKDAY(B40,2),\"Feiertag\")","v":3},{"$f":"S39+IF(F40=\"Z\",-(#REF!*24),IF(G40=\"\",0,(O40+P40-D40)*24))","v":0}]
[null,"2023-08-31","Do",{"$f":"IF(OR(E41=\"F\",F41=\"U\",F41=\"AU\"),'meine Daten'!$C$12,IF(C41=\"Mo\",'meine Daten'!$H$29,IF(C41=\"Di\",'meine Daten'!$H$30,IF(C41=\"Mi\",'meine Daten'!$H$31,IF(C41=\"Do\",'meine Daten'!$H$32,IF(C41=\"Fr\",'meine Daten'!$H$33,IF(C41=\"Sa\",'meine Daten'!$H$34,IF(C41=\"So\",'meine Daten'!$H$35))))))))","v":"08:00:00"},null,null,null,null,"00:00:00",null,null,null,null,"00:00:00","00:00:00",null," ",{"$f":"IF(ISERROR(VLOOKUP(B41,Feiertage!$B$5:$B$21,1,FALSE)),WEEKDAY(B41,2),\"Feiertag\")","v":4},{"$f":"S40+IF(F41=\"Z\",-(#REF!*24),IF(G41=\"\",0,(O41+P41-D41)*24))","v":0}]
[null,null,null,null,null,{"$f":"COUNTIF(F13:F41,\"U\")+COUNTIF(F13:F41,\"Z\")+COUNTIF(F13:F41,AU)","v":0},{"$f":"IF(SUM(G13:G41)<=0,0,1)","v":0},null,null,null,null,null,null,null,null,null,{"$f":"SUM(Q11:Q41)","v":0}]
[null,null,null,null,null,null,null,null,null,null,null,null,null,"Monatssaldo:",null,null,{"$f":"IF(F42+G42=0,\"\",SUM(Q11:Q41))","v":""}]
[null,null,null,null,null,null,null,null,null,null,null,null,null,"Gleitzeitkontostand:",null,null,{"$f":"IF(OR(Q10=\"\",Q43=\"\"),\"\",Q10+Q43)","v":""},null,null,null,null,"Datum, Unterschrift"]
[null,null,null,null,null,null,null,null,null,null,null,null,null,"(In Stunden:Minuten)"]
[null,null,null,null,null,null,null,null,null,null,null,null,null,null,null,null,null,null,null,null,null,null,"„Der Arbeitszeit-Checker“ von Simone Back für www.arbeitszeit-klug-gestalten.de "]
[null,null,null,null,null,null,null,null,null,null,null,null,null,"Urlaubstage",null,null,{"$f":"COUNTIF(F11:F41,\"U\")","v":0}]
[null,null,null,null,null,null,null,null,null,null,null,null,null,null,null,null,null,null,null,null,null,null,"ist lizensiert unter einer Creative Commons Lizenz CC BY SA 4.0 \n(Nutzung bei Namensnennung, Weitergabe unter gleichen Bedingungen)"]
[null,null,null,null,null,null,null,null,null,null,null,null,null,null,null,null,null,null,null,null,null,"Copyright für das Logo \"Arbeitszeit klug gestalten\": RKW Hessen. Das Logo darf nur für den Checker in der Ursprungsform genutzt werden."]

{"sheet":"Sept","index":10,"n_rows":49,"n_cols":23,"rows_kept":49,"cut":false,"hidden":false,"merged":[[48,21,48,25],[45,22,46,25],[9,1,9,15],[46,1,46,2],[3,15,3,16],[6,1,8,1],[6,2,8,2],[6,3,8,3],[6,4,8,4],[6,5,8,5],[6,15,7,15],[7,9,7,10],[7,11,7,12],[47,22,47,25]]}
[null,"Arbeitszeit-Nachweis",null,null,null,null,null,"Name:",null,{"$f":"IF('meine Daten'!C3=\"\",\"\",'meine Daten'!C3)","v":""},null,null,null,null,null,null,null,null,{"$f":"B11","v":"2023-09-01"},{"$f":"B11","v":"2023-09-01"}]
[]
[null,null,null,null,"Symbol* :  ","U","=Urlaub"]
[null,null,null,null,null,"AU","=Krank/Kur",null,null,null,null,null,null,null,"bedeutet:","Eintrag fehlt "]
[null,null,null,null,null,"Z","Zeitausgleich (ganzer Tag)",null,null,null,null,null,null,null,"bedeutet:","mehr als 10 Stunden"]
[]
[null,"Datum","Tag","Sollzeit","Feiertag","Symbol *","Brutto-Arbeitszeit",null,null,"Pausen",null,null,null,null,"Netto","weitere\nReisezeit","Saldo"]
[null,null,null,null,null,null,null,null,null,"Mittag",null,"weitere\n(Std:Min)",null,"Summe","Arbeits-\nzeit",null,"Arbeits-\nzeit"]
[null,null,null,null,null,null,"von","bis","Std:Min","von","bis","I","II","./.Std:Min","Std:Min","Std:Min","Std:Min",null,null,"Bemerkung"]
[null,"Übertrag vom Vormonat: ",null,null,null,null,null,null,null,null,null,null,null,null,null,null,{"$f":"Aug!Q44","v":""}]
[null,{"$f":"Aug!B41+1","v":"2023-09-01"},{"$f":"TEXT(B11,\"TTT\")","v":"Fr"},{"$f":"IF(OR(E11=\"F\",F11=\"U\",F11=\"AU\"),'meine Daten'!$C$12,IF(C11=\"Mo\",'meine Daten'!$M$5,IF(C11=\"Di\",'meine Daten'!$M$6,IF(C11=\"Mi\",'meine Daten'!$M$7,IF(C11=\"Do\",'meine Daten'!$M$8,IF(C11=\"Fr\",'meine Daten'!$M$9,IF(C11=\"Sa\",'meine Daten'!$M$10,IF(C11=\"So\",'meine Daten'!$M$11))))))))","v":"08:00:00"},{"$f":"IF(R11=\"Feiertag\",\"F\",\"\")","v":""},null,null,null,{"$f":"H11-G11","v":"00:00:00"},null,null,null,null,{"$f":"K11-J11+L11+M11","v":"00:00:00"},{"$f":"I11-N11","v":"00:00:00"},null,{"$f":"IF(F11=\"Z\",-(D11),IF(G11=\"\",\" \",IF(O11+P11>D11,O11+P11-D11,IF(O11+P11<D11,-(D11-O11-P11),\" \"))))","v":" "},{"$f":"IF(ISERROR(VLOOKUP(B11,Feiertage!$B$5:$B$21,1,FALSE)),WEEKDAY(B11,2),\"Feiertag\")","v":5},{"$f":"IF(G11=\"\",0,(O11+P11-D11)*24)","v":0}]
[null,{"$f":"B11+1","v":"2023-09-02"},{"$f":"TEXT(B12,\"TTT\")","v":"Sa"},{"$f":"IF(OR(E12=\"F\",F12=\"U\",F12=\"AU\"),'meine Daten'!$C$12,IF(C12=\"Mo\",'meine Daten'!$M$5,IF(C12=\"Di\",'meine Daten'!$M$6,IF(C12=\"Mi\",'meine Daten'!$M$7,IF(C12=\"Do\",'meine Daten'!$M$8,IF(C12=\"Fr\",'meine Daten'!$M$9,IF(C12=\"Sa\",'meine Daten'!$M$10,IF(C12=\"So\",'meine Daten'!$M$11))))))))","v":"00:00:00"},"",null,null,null,{"$f":"H12-G12","v":"00:00:00"},null,null,null,null,{"$f":"K12-J12+L12+M12","v":"00:00:00"},"00:00:00",null,{"$f":"IF(F12=\"Z\",-(D12),IF(G12=\"\",\" \",IF(O12+P12>D12,O12+P12-D12,IF(O12+P12<D12,-(D12-O12-P12),\" \"))))","v":" "},{"$f":"IF(ISERROR(VLOOKUP(B12,Feiertage!$B$5:$B$21,1,FALSE)),WEEKDAY(B12,2),\"Feiertag\")","v":6},{"$f":"S11+IF(F12=\"Z\",-(#REF!*24),IF(G12=\"\",0,(O12+P12-D12)*24))","v":0}]
[null,{"$f":"B12+1","v":"2023-09-03"},"So",{"$f":"IF(OR(E13=\"F\",F13=\"U\",F13=\"AU\"),'meine Daten'!$C$12,IF(C13=\"Mo\",'meine Daten'!$M$5,IF(C13=\"Di\",'meine Daten'!$M$6,IF(C13=\"Mi\",'meine Daten'!$M$7,IF(C13=\"Do\",'meine Daten'!$M$8,IF(C13=\"Fr\",'meine Daten'!$M$9,IF(C13=\"Sa\",'meine Daten'!$M$10,IF(C13=\"So\",'meine Daten'!$M$11))))))))","v":"00:00:00"},"",null,null,null,{"$f":"H13-G13","v":"00:00:00"},null,null,null,null,"00:00:00","00:00:00",null," ",{"$f":"IF(ISERROR(VLOOKUP(B13,Feiertage!$B$5:$B$21,1,FALSE)),WEEKDAY(B13,2),\"Feiertag\")","v":7},{"$f":"S12+IF(F13=\"Z\",-(#REF!*24),IF(G13=\"\",0,(O13+P13-D13)*24))","v":0}]
[null,{"$f":"B13+1","v":"2023-09-04"},"Mo",{"$f":"IF(OR(E14=\"F\",F14=\"U\",F14=\"AU\"),'meine Daten'!$C$12,IF(C14=\"Mo\",'meine Daten'!$M$5,IF(C14=\"Di\",'meine Daten'!$M$6,IF(C14=\"Mi\",'meine Daten'!$M$7,IF(C14=\"Do\",'meine Daten'!$M$8,IF(C14=\"Fr\",'meine Daten'!$M$9,IF(C14=\"Sa\",'meine Daten'!$M$10,IF(C14=\"So\",'meine Daten'!$M$11))))))))","v":"08:00:00"},"",null,null,null,"00:00:00",null,null,null,null,"00:00:00","00:00:00",null," ",{"$f":"IF(ISERROR(VLOOKUP(B14,Feiertage!$B$5:$B$21,1,FALSE)),WEEKDAY(B14,2),\"Feiertag\")","v":1},{"$f":"S13+IF(F14=\"Z\",-(#REF!*24),IF(G14=\"\",0,(O14+P14-D14)*24))","v":0}]
[null,"2023-09-05","Di",{"$f":"IF(OR(E15=\"F\",F15=\"U\",F15=\"AU\"),'meine Daten'!$C$12,IF(C15=\"Mo\",'meine Daten'!$M$5,IF(C15=\"Di\",'meine Daten'!$M$6,IF(C15=\"Mi\",'meine Daten'!$M$7,IF(C15=\"Do\",'meine Daten'!$M$8,IF(C15=\"Fr\",'meine Daten'!$M$9,IF(C15=\"Sa\",'meine Daten'!$M$10,IF(C15=\"So\",'meine Daten'!$M$11))))))))","v":"08:00:00"},"",null,null,null,"00:00:00",null,null,null,null,"00:00:00","00:00:00",null," ",{"$f":"IF(ISERROR(VLOOKUP(B15,Feiertage!$B$5:$B$21,1,FALSE)),WEEKDAY(B15,2),\"Feiertag\")","v":2},{"$f":"S14+IF(F15=\"Z\",-(#REF!*24),IF(G15=\"\",0,(O15+P15-D15)*24))","v":0}]
[null,"2023-09-06","Mi",{"$f":"IF(OR(E16=\"F\",F16=\"U\",F16=\"AU\"),'meine Daten'!$C$12,IF(C16=\"Mo\",'meine Daten'!$M$5,IF(C16=\"Di\",'meine Daten'!$M$6,IF(C16=\"Mi\",'meine Daten'!$M$7,IF(C16=\"Do\",'meine Daten'!$M$8,IF(C16=\"Fr\",'meine Daten'!$M$9,IF(C16=\"Sa\",'meine Daten'!$M$10,IF(C16=\"So\",'meine Daten'!$M$11))))))))","v":"08:00:00"},"",null,null,null,"00:00:00",null,null,null,null,"00:00:00","00:00:00",null," ",{"$f":"IF(ISERROR(VLOOKUP(B16,Feiertage!$B$5:$B$21,1,FALSE)),WEEKDAY(B16,2),\"Feiertag\")","v":3},{"$f":"S15+IF(F16=\"Z\",-(#REF!*24),IF(G16=\"\",0,(O16+P16-D16)*24))","v":0}]
[null,"2023-09-07","Do",{"$f":"IF(OR(E17=\"F\",F17=\"U\",F17=\"AU\"),'meine Daten'!$C$12,IF(C17=\"Mo\",'meine Daten'!$M$5,IF(C17=\"Di\",'meine Daten'!$M$6,IF(C17=\"Mi\",'meine Daten'!$M$7,IF(C17=\"Do\",'meine Daten'!$M$8,IF(C17=\"Fr\",'meine Daten'!$M$9,IF(C17=\"Sa\",'meine Daten'!$M$10,IF(C17=\"So\",'meine Daten'!$M$11))))))))","v":"08:00:00"},"",null,null,null,"00:00:00",null,null,null,null,"00:00:00","00:00:00",null," ",{"$f":"IF(ISERROR(VLOOKUP(B17,Feiertage!$B$5:$B$21,1,FALSE)),WEEKDAY(B17,2),\"Feiertag\")","v":4},{"$f":"S16+IF(F17=\"Z\",-(#REF!*24),IF(G17=\"\",0,(O17+P17-D17)*24))","v":0}]
[null,"2023-09-08","Fr",{"$f":"IF(OR(E18=\"F\",F18=\"U\",F18=\"AU\"),'meine Daten'!$C$12,IF(C18=\"Mo\",'meine Daten'!$M$5,IF(C18=\"Di\",'meine Daten'!$M$6,IF(C18=\"Mi\",'meine Daten'!$M$7,IF(C18=\"Do\",'meine Daten'!$M$8,IF(C18=\"Fr\",'meine Daten'!$M$9,IF(C18=\"Sa\",'meine Daten'!$M$10,IF(C18=\"So\",'meine Daten'!$M$11))))))))","v":"08:00:00"},"",null,null,null,"00:00:00",null,null,null,null,"00:00:00","00:00:00",null," ",{"$f":"IF(ISERROR(VLOOKUP(B18,Feiertage!$B$5:$B$21,1,FALSE)),WEEKDAY(B18,2),\"Feiertag\")","v":5},{"$f":"S17+IF(F18=\"Z\",-(#REF!*24),IF(G18=\"\",0,(O18+P18-D18)*24))","v":0}]
[null,"2023-09-09","Sa",{"$f":"IF(OR(E19=\"F\",F19=\"U\",F19=\"AU\"),'meine Daten'!$C$12,IF(C19=\"Mo\",'meine Daten'!$M$5,IF(C19=\"Di\",'meine Daten'!$M$6,IF(C19=\"Mi\",'meine Daten'!$M$7,IF(C19=\"Do\",'meine Daten'!$M$8,IF(C19=\"Fr\",'meine Daten'!$M$9,IF(C19=\"Sa\",'meine Daten'!$M$10,IF(C19=\"So\",'meine Daten'!$M$11))))))))","v":"00:00:00"},"",null,null,null,"00:00:00",null,null,null,null,"00:00:00","00:00:00",null," ",{"$f":"IF(ISERROR(VLOOKUP(B19,Feiertage!$B$5:$B$21,1,FALSE)),WEEKDAY(B19,2),\"Feiertag\")","v":6},{"$f":"S18+IF(F19=\"Z\",-(#REF!*24),IF(G19=\"\",0,(O19+P19-D19)*24))","v":0}]
[null,"2023-09-10","So",{"$f":"IF(OR(E20=\"F\",F20=\"U\",F20=\"AU\"),'meine Daten'!$C$12,IF(C20=\"Mo\",'meine Daten'!$M$5,IF(C20=\"Di\",'meine Daten'!$M$6,IF(C20=\"Mi\",'meine Daten'!$M$7,IF(C20=\"Do\",'meine Daten'!$M$8,IF(C20=\"Fr\",'meine Daten'!$M$9,IF(C20=\"Sa\",'meine Daten'!$M$10,IF(C20=\"So\",'meine Daten'!$M$11))))))))","v":"00:00:00"},"",null,null,null,"00:00:00",null,null,null,null,"00:00:00","00:00:00",null," ",{"$f":"IF(ISERROR(VLOOKUP(B20,Feiertage!$B$5:$B$21,1,FALSE)),WEEKDAY(B20,2),\"Feiertag\")","v":7},{"$f":"S19+IF(F20=\"Z\",-(#REF!*24),IF(G20=\"\",0,(O20+P20-D20)*24))","v":0}]
[null,"2023-09-11","Mo",{"$f":"IF(OR(E21=\"F\",F21=\"U\",F21=\"AU\"),'meine Daten'!$C$12,IF(C21=\"Mo\",'meine Daten'!$M$5,IF(C21=\"Di\",'meine Daten'!$M$6,IF(C21=\"Mi\",'meine Daten'!$M$7,IF(C21=\"Do\",'meine Daten'!$M$8,IF(C21=\"Fr\",'meine Daten'!$M$9,IF(C21=\"Sa\",'meine Daten'!$M$10,IF(C21=\"So\",'meine Daten'!$M$11))))))))","v":"08:00:00"},"",null,null,null,"00:00:00",null,null,null,null,"00:00:00","00:00:00",null," ",{"$f":"IF(ISERROR(VLOOKUP(B21,Feiertage!$B$5:$B$21,1,FALSE)),WEEKDAY(B21,2),\"Feiertag\")","v":1},{"$f":"S20+IF(F21=\"Z\",-(#REF!*24),IF(G21=\"\",0,(O21+P21-D21)*24))","v":0}]
[null,"2023-09-12","Di",{"$f":"IF(OR(E22=\"F\",F22=\"U\",F22=\"AU\"),'meine Daten'!$C$12,IF(C22=\"Mo\",'meine Daten'!$M$5,IF(C22=\"Di\",'meine Daten'!$M$6,IF(C22=\"Mi\",'meine Daten'!$M$7,IF(C22=\"Do\",'meine Daten'!$M$8,IF(C22=\"Fr\",'meine Daten'!$M$9,IF(C22=\"Sa\",'meine Daten'!$M$10,IF(C22=\"So\",'meine Daten'!$M$11))))))))","v":"08:00:00"},"",null,null,null,"00:00:00",null,null,null,null,"00:00:00","00:00:00",null," ",{"$f":"IF(ISERROR(VLOOKUP(B22,Feiertage!$B$5:$B$21,1,FALSE)),WEEKDAY(B22,2),\"Feiertag\")","v":2},{"$f":"S21+IF(F22=\"Z\",-(#REF!*24),IF(G22=\"\",0,(O22+P22-D22)*24))","v":0}]
[null,"2023-09-13","Mi",{"$f":"IF(OR(E23=\"F\",F23=\"U\",F23=\"AU\"),'meine Daten'!$C$12,IF(C23=\"Mo\",'meine Daten'!$M$5,IF(C23=\"Di\",'meine Daten'!$M$6,IF(C23=\"Mi\",'meine Daten'!$M$7,IF(C23=\"Do\",'meine Daten'!$M$8,IF(C23=\"Fr\",'meine Daten'!$M$9,IF(C23=\"Sa\",'meine Daten'!$M$10,IF(C23=\"So\",'meine Daten'!$M$11))))))))","v":"08:00:00"},"",null,null,null,"00:00:00",null,null,null,null,"00:00:00","00:00:00",null," ",{"$f":"IF(ISERROR(VLOOKUP(B23,Feiertage!$B$5:$B$21,1,FALSE)),WEEKDAY(B23,2),\"Feiertag\")","v":3},{"$f":"S22+IF(F23=\"Z\",-(#REF!*24),IF(G23=\"\",0,(O23+P23-D23)*24))","v":0}]
[null,"2023-09-14","Do",{"$f":"IF(OR(E24=\"F\",F24=\"U\",F24=\"AU\"),'meine Daten'!$C$12,IF(C24=\"Mo\",'meine Daten'!$M$5,IF(C24=\"Di\",'meine Daten'!$M$6,IF(C24=\"Mi\",'meine Daten'!$M$7,IF(C24=\"Do\",'meine Daten'!$M$8,IF(C24=\"Fr\",'meine Daten'!$M$9,IF(C24=\"Sa\",'meine Daten'!$M$10,IF(C24=\"So\",'meine Daten'!$M$11))))))))","v":"08:00:00"},"",null,null,null,"00:00:00",null,null,null,null,"00:00:00","00:00:00",null," ",{"$f":"IF(ISERROR(VLOOKUP(B24,Feiertage!$B$5:$B$21,1,FALSE)),WEEKDAY(B24,2),\"Feiertag\")","v":4},{"$f":"S23+IF(F24=\"Z\",-(#REF!*24),IF(G24=\"\",0,(O24+P24-D24)*24))","v":0}]
[null,"2023-09-15","Fr",{"$f":"IF(OR(E25=\"F\",F25=\"U\",F25=\"AU\"),'meine Daten'!$C$12,IF(C25=\"Mo\",'meine Daten'!$M$5,IF(C25=\"Di\",'meine Daten'!$M$6,IF(C25=\"Mi\",'meine Daten'!$M$7,IF(C25=\"Do\",'meine Daten'!$M$8,IF(C25=\"Fr\",'meine Daten'!$M$9,IF(C25=\"Sa\",'meine Daten'!$M$10,IF(C25=\"So\",'meine Daten'!$M$11))))))))","v":"08:00:00"},"",null,null,null,"00:00:00",null,null,null,null,"00:00:00","00:00:00",null," ",{"$f":"IF(ISERROR(VLOOKUP(B25,Feiertage!$B$5:$B$21,1,FALSE)),WEEKDAY(B25,2),\"Feiertag\")","v":5},{"$f":"S24+IF(F25=\"Z\",-(#REF!*24),IF(G25=\"\",0,(O25+P25-D25)*24))","v":0}]
[null,"2023-09-16","Sa",{"$f":"IF(OR(E26=\"F\",F26=\"U\",F26=\"AU\"),'meine Daten'!$C$12,IF(C26=\"Mo\",'meine Daten'!$M$5,IF(C26=\"Di\",'meine Daten'!$M$6,IF(C26=\"Mi\",'meine Daten'!$M$7,IF(C26=\"Do\",'meine Daten'!$M$8,IF(C26=\"Fr\",'meine Daten'!$M$9,IF(C26=\"Sa\",'meine Daten'!$M$10,IF(C26=\"So\",'meine Daten'!$M$11))))))))","v":"00:00:00"},"",null,null,null,"00:00:00",null,null,null,null,"00:00:00","00:00:00",null," ",{"$f":"IF(ISERROR(VLOOKUP(B26,Feiertage!$B$5:$B$21,1,FALSE)),WEEKDAY(B26,2),\"Feiertag\")","v":6},{"$f":"S25+IF(F26=\"Z\",-(#REF!*24),IF(G26=\"\",0,(O26+P26-D26)*24))","v":0}]
[null,"2023-09-17","So",{"$f":"IF(OR(E27=\"F\",F27=\"U\",F27=\"AU\"),'meine Daten'!$C$12,IF(C27=\"Mo\",'meine Daten'!$M$5,IF(C27=\"Di\",'meine Daten'!$M$6,IF(C27=\"Mi\",'meine Daten'!$M$7,IF(C27=\"Do\",'meine Daten'!$M$8,IF(C27=\"Fr\",'meine Daten'!$M$9,IF(C27=\"Sa\",'meine Daten'!$M$10,IF(C27=\"So\",'meine Daten'!$M$11))))))))","v":"00:00:00"},"",null,null,null,"00:00:00",null,null,null,null,"00:00:00","00:00:00",null," ",{"$f":"IF(ISERROR(VLOOKUP(B27,Feiertage!$B$5:$B$21,1,FALSE)),WEEKDAY(B27,2),\"Feiertag\")","v":7},{"$f":"S26+IF(F27=\"Z\",-(#REF!*24),IF(G27=\"\",0,(O27+P27-D27)*24))","v":0}]
[null,"2023-09-18","Mo",{"$f":"IF(OR(E28=\"F\",F28=\"U\",F28=\"AU\"),'meine Daten'!$C$12,IF(C28=\"Mo\",'meine Daten'!$M$5,IF(C28=\"Di\",'meine Daten'!$M$6,IF(C28=\"Mi\",'meine Daten'!$M$7,IF(C28=\"Do\",'meine Daten'!$M$8,IF(C28=\"Fr\",'meine Daten'!$M$9,IF(C28=\"Sa\",'meine Daten'!$M$10,IF(C28=\"So\",'meine Daten'!$M$11))))))))","v":"08:00:00"},"",null,null,null,"00:00:00",null,null,null,null,"00:00:00","00:00:00",null," ",{"$f":"IF(ISERROR(VLOOKUP(B28,Feiertage!$B$5:$B$21,1,FALSE)),WEEKDAY(B28,2),\"Feiertag\")","v":1},{"$f":"S27+IF(F28=\"Z\",-(#REF!*24),IF(G28=\"\",0,(O28+P28-D28)*24))","v":0}]
[null,"2023-09-19","Di",{"$f":"IF(OR(E29=\"F\",F29=\"U\",F29=\"AU\"),'meine Daten'!$C$12,IF(C29=\"Mo\",'meine Daten'!$M$5,IF(C29=\"Di\",'meine Daten'!$M$6,IF(C29=\"Mi\",'meine Daten'!$M$7,IF(C29=\"Do\",'meine Daten'!$M$8,IF(C29=\"Fr\",'meine Daten'!$M$9,IF(C29=\"Sa\",'meine Daten'!$M$10,IF(C29=\"So\",'meine Daten'!$M$11))))))))","v":"08:00:00"},"",null,null,null,"00:00:00",null,null,null,null,"00:00:00","00:00:00",null," ",{"$f":"IF(ISERROR(VLOOKUP(B29,Feiertage!$B$5:$B$21,1,FALSE)),WEEKDAY(B29,2),\"Feiertag\")","v":2},{"$f":"S28+IF(F29=\"Z\",-(#REF!*24),IF(G29=\"\",0,(O29+P29-D29)*24))","v":0}]
[null,"2023-09-20","Mi",{"$f":"IF(OR(E30=\"F\",F30=\"U\",F30=\"AU\"),'meine Daten'!$C$12,IF(C30=\"Mo\",'meine Daten'!$M$5,IF(C30=\"Di\",'meine Daten'!$M$6,IF(C30=\"Mi\",'meine Daten'!$M$7,IF(C30=\"Do\",'meine Daten'!$M$8,IF(C30=\"Fr\",'meine Daten'!$M$9,IF(C30=\"Sa\",'meine Daten'!$M$10,IF(C30=\"So\",'meine Daten'!$M$11))))))))","v":"08:00:00"},"",null,null,null,"00:00:00",null,null,null,null,"00:00:00","00:00:00",null," ",{"$f":"IF(ISERROR(VLOOKUP(B30,Feiertage!$B$5:$B$21,1,FALSE)),WEEKDAY(B30,2),\"Feiertag\")","v":3},{"$f":"S29+IF(F30=\"Z\",-(#REF!*24),IF(G30=\"\",0,(O30+P30-D30)*24))","v":0}]
[null,"2023-09-21","Do",{"$f":"IF(OR(E31=\"F\",F31=\"U\",F31=\"AU\"),'meine Daten'!$C$12,IF(C31=\"Mo\",'meine Daten'!$M$5,IF(C31=\"Di\",'meine Daten'!$M$6,IF(C31=\"Mi\",'meine Daten'!$M$7,IF(C31=\"Do\",'meine Daten'!$M$8,IF(C31=\"Fr\",'meine Daten'!$M$9,IF(C31=\"Sa\",'meine Daten'!$M$10,IF(C31=\"So\",'meine Daten'!$M$11))))))))","v":"08:00:00"},"",null,null,null,"00:00:00",null,null,null,null,"00:00:00","00:00:00",null," ",{"$f":"IF(ISERROR(VLOOKUP(B31,Feiertage!$B$5:$B$21,1,FALSE)),WEEKDAY(B31,2),\"Feiertag\")","v":4},{"$f":"S30+IF(F31=\"Z\",-(#REF!*24),IF(G31=\"\",0,(O31+P31-D31)*24))","v":0}]
[null,"2023-09-22","Fr",{"$f":"IF(OR(E32=\"F\",F32=\"U\",F32=\"AU\"),'meine Daten'!$C$12,IF(C32=\"Mo\",'meine Daten'!$M$5,IF(C32=\"Di\",'meine Daten'!$M$6,IF(C32=\"Mi\",'meine Daten'!$M$7,IF(C32=\"Do\",'meine Daten'!$M$8,IF(C32=\"Fr\",'meine Daten'!$M$9,IF(C32=\"Sa\",'meine Daten'!$M$10,IF(C32=\"So\",'meine Daten'!$M$11))))))))","v":"08:00:00"},"",null,null,null,"00:00:00",null,null,null,null,"00:00:00","00:00:00",null," ",{"$f":"IF(ISERROR(VLOOKUP(B32,Feiertage!$B$5:$B$21,1,FALSE)),WEEKDAY(B32,2),\"Feiertag\")","v":5},{"$f":"S31+IF(F32=\"Z\",-(#REF!*24),IF(G32=\"\",0,(O32+P32-D32)*24))","v":0}]
[null,"2023-09-23","Sa",{"$f":"IF(OR(E33=\"F\",F33=\"U\",F33=\"AU\"),'meine Daten'!$C$12,IF(C33=\"Mo\",'meine Daten'!$M$5,IF(C33=\"Di\",'meine Daten'!$M$6,IF(C33=\"Mi\",'meine Daten'!$M$7,IF(C33=\"Do\",'meine Daten'!$M$8,IF(C33=\"Fr\",'meine Daten'!$M$9,IF(C33=\"Sa\",'meine Daten'!$M$10,IF(C33=\"So\",'meine Daten'!$M$11))))))))","v":"00:00:00"},"",null,null,null,"00:00:00",null,null,null,null,"00:00:00","00:00:00",null," ",{"$f":"IF(ISERROR(VLOOKUP(B33,Feiertage!$B$5:$B$21,1,FALSE)),WEEKDAY(B33,2),\"Feiertag\")","v":6},{"$f":"S32+IF(F33=\"Z\",-(#REF!*24),IF(G33=\"\",0,(O33+P33-D33)*24))","v":0}]
[null,"2023-09-24","So",{"$f":"IF(OR(E34=\"F\",F34=\"U\",F34=\"AU\"),'meine Daten'!$C$12,IF(C34=\"Mo\",'meine Daten'!$M$5,IF(C34=\"Di\",'meine Daten'!$M$6,IF(C34=\"Mi\",'meine Daten'!$M$7,IF(C34=\"Do\",'meine Daten'!$M$8,IF(C34=\"Fr\",'meine Daten'!$M$9,IF(C34=\"Sa\",'meine Daten'!$M$10,IF(C34=\"So\",'meine Daten'!$M$11))))))))","v":"00:00:00"},"",null,null,null,"00:00:00",null,null,null,null,"00:00:00","00:00:00",null," ",{"$f":"IF(ISERROR(VLOOKUP(B34,Feiertage!$B$5:$B$21,1,FALSE)),WEEKDAY(B34,2),\"Feiertag\")","v":7},{"$f":"S33+IF(F34=\"Z\",-(#REF!*24),IF(G34=\"\",0,(O34+P34-D34)*24))","v":0}]
[null,"2023-09-25","Mo",{"$f":"IF(OR(E35=\"F\",F35=\"U\",F35=\"AU\"),'meine Daten'!$C$12,IF(C35=\"Mo\",'meine Daten'!$M$5,IF(C35=\"Di\",'meine Daten'!$M$6,IF(C35=\"Mi\",'meine Daten'!$M$7,IF(C35=\"Do\",'meine Daten'!$M$8,IF(C35=\"Fr\",'meine Daten'!$M$9,IF(C35=\"Sa\",'meine Daten'!$M$10,IF(C35=\"So\",'meine Daten'!$M$11))))))))","v":"08:00:00"},"",null,null,null,"00:00:00",null,null,null,null,"00:00:00","00:00:00",null," ",{"$f":"IF(ISERROR(VLOOKUP(B35,Feiertage!$B$5:$B$21,1,FALSE)),WEEKDAY(B35,2),\"Feiertag\")","v":1},{"$f":"S34+IF(F35=\"Z\",-(#REF!*24),IF(G35=\"\",0,(O35+P35-D35)*24))","v":0}]
[null,"2023-09-26","Di",{"$f":"IF(OR(E36=\"F\",F36=\"U\",F36=\"AU\"),'meine Daten'!$C$12,IF(C36=\"Mo\",'meine Daten'!$M$5,IF(C36=\"Di\",'meine Daten'!$M$6,IF(C36=\"Mi\",'meine Daten'!$M$7,IF(C36=\"Do\",'meine Daten'!$M$8,IF(C36=\"Fr\",'meine Daten'!$M$9,IF(C36=\"Sa\",'meine Daten'!$M$10,IF(C36=\"So\",'meine Daten'!$M$11))))))))","v":"08:00:00"},"",null,null,null,"00:00:00",null,null,null,null,"00:00:00","00:00:00",null," ",{"$f":"IF(ISERROR(VLOOKUP(B36,Feiertage!$B$5:$B$21,1,FALSE)),WEEKDAY(B36,2),\"Feiertag\")","v":2},{"$f":"S35+IF(F36=\"Z\",-(#REF!*24),IF(G36=\"\",0,(O36+P36-D36)*24))","v":0}]
[null,"2023-09-27","Mi",{"$f":"IF(OR(E37=\"F\",F37=\"U\",F37=\"AU\"),'meine Daten'!$C$12,IF(C37=\"Mo\",'meine Daten'!$M$5,IF(C37=\"Di\",'meine Daten'!$M$6,IF(C37=\"Mi\",'meine Daten'!$M$7,IF(C37=\"Do\",'meine Daten'!$M$8,IF(C37=\"Fr\",'meine Daten'!$M$9,IF(C37=\"Sa\",'meine Daten'!$M$10,IF(C37=\"So\",'meine Daten'!$M$11))))))))","v":"08:00:00"},"",null,null,null,"00:00:00",null,null,null,null,"00:00:00","00:00:00",null," ",{"$f":"IF(ISERROR(VLOOKUP(B37,Feiertage!$B$5:$B$21,1,FALSE)),WEEKDAY(B37,2),\"Feiertag\")","v":3},{"$f":"S36+IF(F37=\"Z\",-(#REF!*24),IF(G37=\"\",0,(O37+P37-D37)*24))","v":0}]
[null,"2023-09-28","Do",{"$f":"IF(OR(E38=\"F\",F38=\"U\",F38=\"AU\"),'meine Daten'!$C$12,IF(C38=\"Mo\",'meine Daten'!$M$5,IF(C38=\"Di\",'meine Daten'!$M$6,IF(C38=\"Mi\",'meine Daten'!$M$7,IF(C38=\"Do\",'meine Daten'!$M$8,IF(C38=\"Fr\",'meine Daten'!$M$9,IF(C38=\"Sa\",'meine Daten'!$M$10,IF(C38=\"So\",'meine Daten'!$M$11))))))))","v":"08:00:00"},"",null,null,null,"00:00:00",null,null,null,null,"00:00:00","00:00:00",null," ",{"$f":"IF(ISERROR(VLOOKUP(B38,Feiertage!$B$5:$B$21,1,FALSE)),WEEKDAY(B38,2),\"Feiertag\")","v":4},{"$f":"S37+IF(F38=\"Z\",-(#REF!*24),IF(G38=\"\",0,(O38+P38-D38)*24))","v":0},null,null,"Ich versichere die Richtigkeit meiner Angaben. Mir ist bekannt, "]
[null,"2023-09-29","Fr",{"$f":"IF(OR(E39=\"F\",F39=\"U\",F39=\"AU\"),'meine Daten'!$C$12,IF(C39=\"Mo\",'meine Daten'!$M$5,IF(C39=\"Di\",'meine Daten'!$M$6,IF(C39=\"Mi\",'meine Daten'!$M$7,IF(C39=\"Do\",'meine Daten'!$M$8,IF(C39=\"Fr\",'meine Daten'!$M$9,IF(C39=\"Sa\",'meine Daten'!$M$10,IF(C39=\"So\",'meine Daten'!$M$11))))))))","v":"08:00:00"},"",null,null,null,"00:00:00",null,null,null,null,"00:00:00","00:00:00",null," ",{"$f":"IF(ISERROR(VLOOKUP(B39,Feiertage!$B$5:$B$21,1,FALSE)),WEEKDAY(B39,2),\"Feiertag\")","v":5},{"$f":"S38+IF(F39=\"Z\",-(#REF!*24),IF(G39=\"\",0,(O39+P39-D39)*24))","v":0},null,null,"dass unrichtige Angaben eine grobe Pflichtverletzung darstellen. "]
[null,"2023-09-30","Sa",{"$f":"IF(OR(E40=\"F\",F40=\"U\",F40=\"AU\"),'meine Daten'!$C$12,IF(C40=\"Mo\",'meine Daten'!$M$5,IF(C40=\"Di\",'meine Daten'!$M$6,IF(C40=\"Mi\",'meine Daten'!$M$7,IF(C40=\"Do\",'meine Daten'!$M$8,IF(C40=\"Fr\",'meine Daten'!$M$9,IF(C40=\"Sa\",'meine Daten'!$M$10,IF(C40=\"So\",'meine Daten'!$M$11))))))))","v":"00:00:00"},null,null,null,null,"00:00:00",null,null,null,null,"00:00:00","00:00:00",null," ",{"$f":"IF(ISERROR(VLOOKUP(B40,Feiertage!$B$5:$B$21,1,FALSE)),WEEKDAY(B40,2),\"Feiertag\")","v":6},{"$f":"#REF!+IF(F40=\"Z\",-(#REF!*24),IF(G40=\"\",0,(O40+P40-D40)*24))","v":{"$error":"#REF!"}}]
[null,null,null,null,null,{"$f":"COUNTIF(F13:F40,\"U\")+COUNTIF(F13:F40,\"Z\")+COUNTIF(F13:F40,AU)","v":0},{"$f":"IF(SUM(G13:G40)<=0,0,1)","v":0},null,null,null,null,null,null,null,null,null,{"$f":"SUM(Q11:Q40)","v":0}]
[null,null,null,null,null,null,null,null,null,null,null,null,null,"Monatssaldo:",null,null,{"$f":"IF(F41+G41=0,\"\",SUM(Q11:Q40))","v":""}]
[null,null,null,null,null,null,null,null,null,null,null,null,null,"Gleitzeitkontostand:",null,null,{"$f":"IF(OR(Q10=\"\",Q42=\"\"),\"\",Q10+Q42)","v":""}]
[null,null,null,null,null,null,null,null,null,null,null,null,null,"(In Stunden:Minuten)",null,null,null,null,null,null,null,"Datum, Unterschrift"]
[]
[null,null,null,null,null,null,null,null,null,null,null,null,null,"Urlaubstage",null,null,{"$f":"COUNTIF(F11:F40,\"U\")","v":0},null,null,null,null,null,"„Der Arbeitszeit-Checker“ von Simone Back für www.arbeitszeit-klug-gestalten.de "]
[]
[null,null,null,null,null,null,null,null,null,null,null,null,null,null,null,null,null,null,null,null,null,null,"ist lizensiert unter einer Creative Commons Lizenz CC BY SA 4.0 \n(Nutzung bei Namensnennung, Weitergabe unter gleichen Bedingungen)"]
[null,null,null,null,null,null,null,null,null,null,null,null,null,null,null,null,null,null,null,null,null,"Copyright für das Logo \"Arbeitszeit klug gestalten\": RKW Hessen. Das Logo darf nur für den Checker in der Ursprungsform genutzt werden."]

{"sheet":"Okt","index":11,"n_rows":49,"n_cols":23,"rows_kept":49,"cut":false,"hidden":false,"merged":[[48,21,49,25],[45,22,46,25],[9,1,9,15],[47,1,47,2],[3,15,3,16],[6,1,8,1],[6,2,8,2],[6,3,8,3],[6,4,8,4],[6,5,8,5],[6,15,7,15],[7,9,7,10],[7,11,7,12],[47,22,47,25]]}
[null,"Arbeitszeit-Nachweis",null,null,null,null,null,"Name:",null,{"$f":"IF('meine Daten'!C3=\"\",\"\",'meine Daten'!C3)","v":""},null,null,null,null,null,null,null,null,{"$f":"B11","v":"2023-10-01"},{"$f":"B11","v":"2023-10-01"}]
[]
[null,null,null,null,"Symbol* :  ","U","=Urlaub"]
[null,null,null,null,null,"AU","=Krank/Kur",null,null,null,null,null,null,null,"bedeutet:","Eintrag fehlt "]
[null,null,null,null,null,"Z","Zeitausgleich (ganzer Tag)",null,null,null,null,null,null,null,"bedeutet:","mehr als 10 Stunden"]
[]
[null,"Datum","Tag","Sollzeit","Feiertag","Symbol *","Brutto-Arbeitszeit",null,null,"Pausen",null,null,null,null,"Netto","weitere\nReisezeit","Saldo"]
[null,null,null,null,null,null,null,null,null,"Mittag",null,"weitere\n(Std:Min)",null,"Summe","Arbeits-\nzeit",null,"Arbeits-\nzeit"]
[null,null,null,null,null,null,"von","bis","Std:Min","von","bis","I","II","./.Std:Min","Std:Min","Std:Min","Std:Min",null,null,"Bemerkung"]
[null,"Übertrag vom Vormonat: ",null,null,null,null,null,null,null,null,null,null,null,null,null,null,{"$f":"Sept!Q43","v":""}]
[null,{"$f":"Sept!B40+1","v":"2023-10-01"},{"$f":"TEXT(B11,\"TTT\")","v":"So"},{"$f":"IF(OR(E11=\"F\",F11=\"U\",F11=\"AU\"),'meine Daten'!$C$12,IF(C11=\"Mo\",'meine Daten'!$M$13,IF(C11=\"Di\",'meine Daten'!$M$14,IF(C11=\"Mi\",'meine Daten'!$M$15,IF(C11=\"Do\",'meine Daten'!$M$16,IF(C11=\"Fr\",'meine Daten'!$M$17,IF(C11=\"Sa\",'meine Daten'!$M$18,IF(C11=\"So\",'meine Daten'!$M$19))))))))","v":"00:00:00"},{"$f":"IF(R11=\"Feiertag\",\"F\",\"\")","v":""},null,null,null,{"$f":"H11-G11","v":"00:00:00"},null,null,null,null,{"$f":"K11-J11+L11+M11","v":"00:00:00"},{"$f":"I11-N11","v":"00:00:00"},null,{"$f":"IF(F11=\"Z\",-(D11),IF(G11=\"\",\" \",IF(O11+P11>D11,O11+P11-D11,IF(O11+P11<D11,-(D11-O11-P11),\" \"))))","v":" "},{"$f":"IF(ISERROR(VLOOKUP(B11,Feiertage!$B$5:$B$21,1,FALSE)),WEEKDAY(B11,2),\"Feiertag\")","v":7},{"$f":"IF(G11=\"\",0,(O11+P11-D11)*24)","v":0}]
[null,{"$f":"B11+1","v":"2023-10-02"},{"$f":"TEXT(B12,\"TTT\")","v":"Mo"},{"$f":"IF(OR(E12=\"F\",F12=\"U\",F12=\"AU\"),'meine Daten'!$C$12,IF(C12=\"Mo\",'meine Daten'!$M$13,IF(C12=\"Di\",'meine Daten'!$M$14,IF(C12=\"Mi\",'meine Daten'!$M$15,IF(C12=\"Do\",'meine Daten'!$M$16,IF(C12=\"Fr\",'meine Daten'!$M$17,IF(C12=\"Sa\",'meine Daten'!$M$18,IF(C12=\"So\",'meine Daten'!$M$19))))))))","v":"08:00:00"},"",null,null,null,{"$f":"H12-G12","v":"00:00:00"},null,null,null,null,{"$f":"K12-J12+L12+M12","v":"00:00:00"},"00:00:00",null,{"$f":"IF(F12=\"Z\",-(D12),IF(G12=\"\",\" \",IF(O12+P12>D12,O12+P12-D12,IF(O12+P12<D12,-(D12-O12-P12),\" \"))))","v":" "},{"$f":"IF(ISERROR(VLOOKUP(B12,Feiertage!$B$5:$B$21,1,FALSE)),WEEKDAY(B12,2),\"Feiertag\")","v":1},{"$f":"S11+IF(F12=\"Z\",-(#REF!*24),IF(G12=\"\",0,(O12+P12-D12)*24))","v":0}]
[null,{"$f":"B12+1","v":"2023-10-03"},"Di",{"$f":"IF(OR(E13=\"F\",F13=\"U\",F13=\"AU\"),'meine Daten'!$C$12,IF(C13=\"Mo\",'meine Daten'!$M$13,IF(C13=\"Di\",'meine Daten'!$M$14,IF(C13=\"Mi\",'meine Daten'!$M$15,IF(C13=\"Do\",'meine Daten'!$M$16,IF(C13=\"Fr\",'meine Daten'!$M$17,IF(C13=\"Sa\",'meine Daten'!$M$18,IF(C13=\"So\",'meine Daten'!$M$19))))))))","v":"00:00:00"},"F",null,null,null,{"$f":"H13-G13","v":"00:00:00"},null,null,null,null,"00:00:00","00:00:00",null," ",{"$f":"IF(ISERROR(VLOOKUP(B13,Feiertage!$B$5:$B$21,1,FALSE)),WEEKDAY(B13,2),\"Feiertag\")","v":"Feiertag"},{"$f":"S12+IF(F13=\"Z\",-(#REF!*24),IF(G13=\"\",0,(O13+P13-D13)*24))","v":0}]
[null,"2023-10-04","Mi",{"$f":"IF(OR(E14=\"F\",F14=\"U\",F14=\"AU\"),'meine Daten'!$C$12,IF(C14=\"Mo\",'meine Daten'!$M$13,IF(C14=\"Di\",'meine Daten'!$M$14,IF(C14=\"Mi\",'meine Daten'!$M$15,IF(C14=\"Do\",'meine Daten'!$M$16,IF(C14=\"Fr\",'meine Daten'!$M$17,IF(C14=\"Sa\",'meine Daten'!$M$18,IF(C14=\"So\",'meine Daten'!$M$19))))))))","v":"08:00:00"},"",null,null,null,"00:00:00",null,null,null,null,"00:00:00","00:00:00",null," ",{"$f":"IF(ISERROR(VLOOKUP(B14,Feiertage!$B$5:$B$21,1,FALSE)),WEEKDAY(B14,2),\"Feiertag\")","v":3},{"$f":"S13+IF(F14=\"Z\",-(#REF!*24),IF(G14=\"\",0,(O14+P14-D14)*24))","v":0}]
[null,"2023-10-05","Do",{"$f":"IF(OR(E15=\"F\",F15=\"U\",F15=\"AU\"),'meine Daten'!$C$12,IF(C15=\"Mo\",'meine Daten'!$M$13,IF(C15=\"Di\",'meine Daten'!$M$14,IF(C15=\"Mi\",'meine Daten'!$M$15,IF(C15=\"Do\",'meine Daten'!$M$16,IF(C15=\"Fr\",'meine Daten'!$M$17,IF(C15=\"Sa\",'meine Daten'!$M$18,IF(C15=\"So\",'meine Daten'!$M$19))))))))","v":"08:00:00"},"",null,null,null,"00:00:00",null,null,null,null,"00:00:00","00:00:00",null," ",{"$f":"IF(ISERROR(VLOOKUP(B15,Feiertage!$B$5:$B$21,1,FALSE)),WEEKDAY(B15,2),\"Feiertag\")","v":4},{"$f":"S14+IF(F15=\"Z\",-(#REF!*24),IF(G15=\"\",0,(O15+P15-D15)*24))","v":0}]
[null,"2023-10-06","Fr",{"$f":"IF(OR(E16=\"F\",F16=\"U\",F16=\"AU\"),'meine Daten'!$C$12,IF(C16=\"Mo\",'meine Daten'!$M$13,IF(C16=\"Di\",'meine Daten'!$M$14,IF(C16=\"Mi\",'meine Daten'!$M$15,IF(C16=\"Do\",'meine Daten'!$M$16,IF(C16=\"Fr\",'meine Daten'!$M$17,IF(C16=\"Sa\",'meine Daten'!$M$18,IF(C16=\"So\",'meine Daten'!$M$19))))))))","v":"08:00:00"},"",null,null,null,"00:00:00",null,null,null,null,"00:00:00","00:00:00",null," ",{"$f":"IF(ISERROR(VLOOKUP(B16,Feiertage!$B$5:$B$21,1,FALSE)),WEEKDAY(B16,2),\"Feiertag\")","v":5},{"$f":"S15+IF(F16=\"Z\",-(#REF!*24),IF(G16=\"\",0,(O16+P16-D16)*24))","v":0}]
[null,"2023-10-07","Sa",{"$f":"IF(OR(E17=\"F\",F17=\"U\",F17=\"AU\"),'meine Daten'!$C$12,IF(C17=\"Mo\",'meine Daten'!$M$13,IF(C17=\"Di\",'meine Daten'!$M$14,IF(C17=\"Mi\",'meine Daten'!$M$15,IF(C17=\"Do\",'meine Daten'!$M$16,IF(C17=\"Fr\",'meine Daten'!$M$17,IF(C17=\"Sa\",'meine Daten'!$M$18,IF(C17=\"So\",'meine Daten'!$M$19))))))))","v":"00:00:00"},"",null,null,null,"00:00:00",null,null,null,null,"00:00:00","00:00:00",null," ",{"$f":"IF(ISERROR(VLOOKUP(B17,Feiertage!$B$5:$B$21,1,FALSE)),WEEKDAY(B17,2),\"Feiertag\")","v":6},{"$f":"S16+IF(F17=\"Z\",-(#REF!*24),IF(G17=\"\",0,(O17+P17-D17)*24))","v":0}]
[null,"2023-10-08","So",{"$f":"IF(OR(E18=\"F\",F18=\"U\",F18=\"AU\"),'meine Daten'!$C$12,IF(C18=\"Mo\",'meine Daten'!$M$13,IF(C18=\"Di\",'meine Daten'!$M$14,IF(C18=\"Mi\",'meine Daten'!$M$15,IF(C18=\"Do\",'meine Daten'!$M$16,IF(C18=\"Fr\",'meine Daten'!$M$17,IF(C18=\"Sa\",'meine Daten'!$M$18,IF(C18=\"So\",'meine Daten'!$M$19))))))))","v":"00:00:00"},"",null,null,null,"00:00:00",null,null,null,null,"00:00:00","00:00:00",null," ",{"$f":"IF(ISERROR(VLOOKUP(B18,Feiertage!$B$5:$B$21,1,FALSE)),WEEKDAY(B18,2),\"Feiertag\")","v":7},{"$f":"S17+IF(F18=\"Z\",-(#REF!*24),IF(G18=\"\",0,(O18+P18-D18)*24))","v":0}]
[null,"2023-10-09","Mo",{"$f":"IF(OR(E19=\"F\",F19=\"U\",F19=\"AU\"),'meine Daten'!$C$12,IF(C19=\"Mo\",'meine Daten'!$M$13,IF(C19=\"Di\",'meine Daten'!$M$14,IF(C19=\"Mi\",'meine Daten'!$M$15,IF(C19=\"Do\",'meine Daten'!$M$16,IF(C19=\"Fr\",'meine Daten'!$M$17,IF(C19=\"Sa\",'meine Daten'!$M$18,IF(C19=\"So\",'meine Daten'!$M$19))))))))","v":"08:00:00"},"",null,null,null,"00:00:00",null,null,null,null,"00:00:00","00:00:00",null," ",{"$f":"IF(ISERROR(VLOOKUP(B19,Feiertage!$B$5:$B$21,1,FALSE)),WEEKDAY(B19,2),\"Feiertag\")","v":1},{"$f":"S18+IF(F19=\"Z\",-(#REF!*24),IF(G19=\"\",0,(O19+P19-D19)*24))","v":0}]
[null,"2023-10-10","Di",{"$f":"IF(OR(E20=\"F\",F20=\"U\",F20=\"AU\"),'meine Daten'!$C$12,IF(C20=\"Mo\",'meine Daten'!$M$13,IF(C20=\"Di\",'meine Daten'!$M$14,IF(C20=\"Mi\",'meine Daten'!$M$15,IF(C20=\"Do\",'meine Daten'!$M$16,IF(C20=\"Fr\",'meine Daten'!$M$17,IF(C20=\"Sa\",'meine Daten'!$M$18,IF(C20=\"So\",'meine Daten'!$M$19))))))))","v":"08:00:00"},"",null,null,null,"00:00:00",null,null,null,null,"00:00:00","00:00:00",null," ",{"$f":"IF(ISERROR(VLOOKUP(B20,Feiertage!$B$5:$B$21,1,FALSE)),WEEKDAY(B20,2),\"Feiertag\")","v":2},{"$f":"S19+IF(F20=\"Z\",-(#REF!*24),IF(G20=\"\",0,(O20+P20-D20)*24))","v":0}]
[null,"2023-10-11","Mi",{"$f":"IF(OR(E21=\"F\",F21=\"U\",F21=\"AU\"),'meine Daten'!$C$12,IF(C21=\"Mo\",'meine Daten'!$M$13,IF(C21=\"Di\",'meine Daten'!$M$14,IF(C21=\"Mi\",'meine Daten'!$M$15,IF(C21=\"Do\",'meine Daten'!$M$16,IF(C21=\"Fr\",'meine Daten'!$M$17,IF(C21=\"Sa\",'meine Daten'!$M$18,IF(C21=\"So\",'meine Daten'!$M$19))))))))","v":"08:00:00"},"",null,null,null,"00:00:00",null,null,null,null,"00:00:00","00:00:00",null," ",{"$f":"IF(ISERROR(VLOOKUP(B21,Feiertage!$B$5:$B$21,1,FALSE)),WEEKDAY(B21,2),\"Feiertag\")","v":3},{"$f":"S20+IF(F21=\"Z\",-(#REF!*24),IF(G21=\"\",0,(O21+P21-D21)*24))","v":0}]
[null,"2023-10-12","Do",{"$f":"IF(OR(E22=\"F\",F22=\"U\",F22=\"AU\"),'meine Daten'!$C$12,IF(C22=\"Mo\",'meine Daten'!$M$13,IF(C22=\"Di\",'meine Daten'!$M$14,IF(C22=\"Mi\",'meine Daten'!$M$15,IF(C22=\"Do\",'meine Daten'!$M$16,IF(C22=\"Fr\",'meine Daten'!$M$17,IF(C22=\"Sa\",'meine Daten'!$M$18,IF(C22=\"So\",'meine Daten'!$M$19))))))))","v":"08:00:00"},"",null,null,null,"00:00:00",null,null,null,null,"00:00:00","00:00:00",null," ",{"$f":"IF(ISERROR(VLOOKUP(B22,Feiertage!$B$5:$B$21,1,FALSE)),WEEKDAY(B22,2),\"Feiertag\")","v":4},{"$f":"S21+IF(F22=\"Z\",-(#REF!*24),IF(G22=\"\",0,(O22+P22-D22)*24))","v":0}]
[null,"2023-10-13","Fr",{"$f":"IF(OR(E23=\"F\",F23=\"U\",F23=\"AU\"),'meine Daten'!$C$12,IF(C23=\"Mo\",'meine Daten'!$M$13,IF(C23=\"Di\",'meine Daten'!$M$14,IF(C23=\"Mi\",'meine Daten'!$M$15,IF(C23=\"Do\",'meine Daten'!$M$16,IF(C23=\"Fr\",'meine Daten'!$M$17,IF(C23=\"Sa\",'meine Daten'!$M$18,IF(C23=\"So\",'meine Daten'!$M$19))))))))","v":"08:00:00"},"",null,null,null,"00:00:00",null,null,null,null,"00:00:00","00:00:00",null," ",{"$f":"IF(ISERROR(VLOOKUP(B23,Feiertage!$B$5:$B$21,1,FALSE)),WEEKDAY(B23,2),\"Feiertag\")","v":5},{"$f":"S22+IF(F23=\"Z\",-(#REF!*24),IF(G23=\"\",0,(O23+P23-D23)*24))","v":0}]
[null,"2023-10-14","Sa",{"$f":"IF(OR(E24=\"F\",F24=\"U\",F24=\"AU\"),'meine Daten'!$C$12,IF(C24=\"Mo\",'meine Daten'!$M$13,IF(C24=\"Di\",'meine Daten'!$M$14,IF(C24=\"Mi\",'meine Daten'!$M$15,IF(C24=\"Do\",'meine Daten'!$M$16,IF(C24=\"Fr\",'meine Daten'!$M$17,IF(C24=\"Sa\",'meine Daten'!$M$18,IF(C24=\"So\",'meine Daten'!$M$19))))))))","v":"00:00:00"},"",null,null,null,"00:00:00",null,null,null,null,"00:00:00","00:00:00",null," ",{"$f":"IF(ISERROR(VLOOKUP(B24,Feiertage!$B$5:$B$21,1,FALSE)),WEEKDAY(B24,2),\"Feiertag\")","v":6},{"$f":"S23+IF(F24=\"Z\",-(#REF!*24),IF(G24=\"\",0,(O24+P24-D24)*24))","v":0}]
[null,"2023-10-15","So",{"$f":"IF(OR(E25=\"F\",F25=\"U\",F25=\"AU\"),'meine Daten'!$C$12,IF(C25=\"Mo\",'meine Daten'!$M$13,IF(C25=\"Di\",'meine Daten'!$M$14,IF(C25=\"Mi\",'meine Daten'!$M$15,IF(C25=\"Do\",'meine Daten'!$M$16,IF(C25=\"Fr\",'meine Daten'!$M$17,IF(C25=\"Sa\",'meine Daten'!$M$18,IF(C25=\"So\",'meine Daten'!$M$19))))))))","v":"00:00:00"},"",null,null,null,"00:00:00",null,null,null,null,"00:00:00","00:00:00",null," ",{"$f":"IF(ISERROR(VLOOKUP(B25,Feiertage!$B$5:$B$21,1,FALSE)),WEEKDAY(B25,2),\"Feiertag\")","v":7},{"$f":"S24+IF(F25=\"Z\",-(#REF!*24),IF(G25=\"\",0,(O25+P25-D25)*24))","v":0}]
[null,"2023-10-16","Mo",{"$f":"IF(OR(E26=\"F\",F26=\"U\",F26=\"AU\"),'meine Daten'!$C$12,IF(C26=\"Mo\",'meine Daten'!$M$13,IF(C26=\"Di\",'meine Daten'!$M$14,IF(C26=\"Mi\",'meine Daten'!$M$15,IF(C26=\"Do\",'meine Daten'!$M$16,IF(C26=\"Fr\",'meine Daten'!$M$17,IF(C26=\"Sa\",'meine Daten'!$M$18,IF(C26=\"So\",'meine Daten'!$M$19))))))))","v":"08:00:00"},"",null,null,null,"00:00:00",null,null,null,null,"00:00:00","00:00:00",null," ",{"$f":"IF(ISERROR(VLOOKUP(B26,Feiertage!$B$5:$B$21,1,FALSE)),WEEKDAY(B26,2),\"Feiertag\")","v":1},{"$f":"S25+IF(F26=\"Z\",-(#REF!*24),IF(G26=\"\",0,(O26+P26-D26)*24))","v":0}]
[null,"2023-10-17","Di",{"$f":"IF(OR(E27=\"F\",F27=\"U\",F27=\"AU\"),'meine Daten'!$C$12,IF(C27=\"Mo\",'meine Daten'!$M$13,IF(C27=\"Di\",'meine Daten'!$M$14,IF(C27=\"Mi\",'meine Daten'!$M$15,IF(C27=\"Do\",'meine Daten'!$M$16,IF(C27=\"Fr\",'meine Daten'!$M$17,IF(C27=\"Sa\",'meine Daten'!$M$18,IF(C27=\"So\",'meine Daten'!$M$19))))))))","v":"08:00:00"},"",null,null,null,"00:00:00",null,null,null,null,"00:00:00","00:00:00",null," ",{"$f":"IF(ISERROR(VLOOKUP(B27,Feiertage!$B$5:$B$21,1,FALSE)),WEEKDAY(B27,2),\"Feiertag\")","v":2},{"$f":"S26+IF(F27=\"Z\",-(#REF!*24),IF(G27=\"\",0,(O27+P27-D27)*24))","v":0}]
[null,"2023-10-18","Mi",{"$f":"IF(OR(E28=\"F\",F28=\"U\",F28=\"AU\"),'meine Daten'!$C$12,IF(C28=\"Mo\",'meine Daten'!$M$13,IF(C28=\"Di\",'meine Daten'!$M$14,IF(C28=\"Mi\",'meine Daten'!$M$15,IF(C28=\"Do\",'meine Daten'!$M$16,IF(C28=\"Fr\",'meine Daten'!$M$17,IF(C28=\"Sa\",'meine Daten'!$M$18,IF(C28=\"So\",'meine Daten'!$M$19))))))))","v":"08:00:00"},"",null,null,null,"00:00:00",null,null,null,null,"00:00:00","00:00:00",null," ",{"$f":"IF(ISERROR(VLOOKUP(B28,Feiertage!$B$5:$B$21,1,FALSE)),WEEKDAY(B28,2),\"Feiertag\")","v":3},{"$f":"S27+IF(F28=\"Z\",-(#REF!*24),IF(G28=\"\",0,(O28+P28-D28)*24))","v":0}]
[null,"2023-10-19","Do",{"$f":"IF(OR(E29=\"F\",F29=\"U\",F29=\"AU\"),'meine Daten'!$C$12,IF(C29=\"Mo\",'meine Daten'!$M$13,IF(C29=\"Di\",'meine Daten'!$M$14,IF(C29=\"Mi\",'meine Daten'!$M$15,IF(C29=\"Do\",'meine Daten'!$M$16,IF(C29=\"Fr\",'meine Daten'!$M$17,IF(C29=\"Sa\",'meine Daten'!$M$18,IF(C29=\"So\",'meine Daten'!$M$19))))))))","v":"08:00:00"},"",null,null,null,"00:00:00",null,null,null,null,"00:00:00","00:00:00",null," ",{"$f":"IF(ISERROR(VLOOKUP(B29,Feiertage!$B$5:$B$21,1,FALSE)),WEEKDAY(B29,2),\"Feiertag\")","v":4},{"$f":"S28+IF(F29=\"Z\",-(#REF!*24),IF(G29=\"\",0,(O29+P29-D29)*24))","v":0}]
[null,"2023-10-20","Fr",{"$f":"IF(OR(E30=\"F\",F30=\"U\",F30=\"AU\"),'meine Daten'!$C$12,IF(C30=\"Mo\",'meine Daten'!$M$13,IF(C30=\"Di\",'meine Daten'!$M$14,IF(C30=\"Mi\",'meine Daten'!$M$15,IF(C30=\"Do\",'meine Daten'!$M$16,IF(C30=\"Fr\",'meine Daten'!$M$17,IF(C30=\"Sa\",'meine Daten'!$M$18,IF(C30=\"So\",'meine Daten'!$M$19))))))))","v":"08:00:00"},"",null,null,null,"00:00:00",null,null,null,null,"00:00:00","00:00:00",null," ",{"$f":"IF(ISERROR(VLOOKUP(B30,Feiertage!$B$5:$B$21,1,FALSE)),WEEKDAY(B30,2),\"Feiertag\")","v":5},{"$f":"S29+IF(F30=\"Z\",-(#REF!*24),IF(G30=\"\",0,(O30+P30-D30)*24))","v":0}]
[null,"2023-10-21","Sa",{"$f":"IF(OR(E31=\"F\",F31=\"U\",F31=\"AU\"),'meine Daten'!$C$12,IF(C31=\"Mo\",'meine Daten'!$M$13,IF(C31=\"Di\",'meine Daten'!$M$14,IF(C31=\"Mi\",'meine Daten'!$M$15,IF(C31=\"Do\",'meine Daten'!$M$16,IF(C31=\"Fr\",'meine Daten'!$M$17,IF(C31=\"Sa\",'meine Daten'!$M$18,IF(C31=\"So\",'meine Daten'!$M$19))))))))","v":"00:00:00"},"",null,null,null,"00:00:00",null,null,null,null,"00:00:00","00:00:00",null," ",{"$f":"IF(ISERROR(VLOOKUP(B31,Feiertage!$B$5:$B$21,1,FALSE)),WEEKDAY(B31,2),\"Feiertag\")","v":6},{"$f":"S30+IF(F31=\"Z\",-(#REF!*24),IF(G31=\"\",0,(O31+P31-D31)*24))","v":0}]
[null,"2023-10-22","So",{"$f":"IF(OR(E32=\"F\",F32=\"U\",F32=\"AU\"),'meine Daten'!$C$12,IF(C32=\"Mo\",'meine Daten'!$M$13,IF(C32=\"Di\",'meine Daten'!$M$14,IF(C32=\"Mi\",'meine Daten'!$M$15,IF(C32=\"Do\",'meine Daten'!$M$16,IF(C32=\"Fr\",'meine Daten'!$M$17,IF(C32=\"Sa\",'meine Daten'!$M$18,IF(C32=\"So\",'meine Daten'!$M$19))))))))","v":"00:00:00"},"",null,null,null,"00:00:00",null,null,null,null,"00:00:00","00:00:00",null," ",{"$f":"IF(ISERROR(VLOOKUP(B32,Feiertage!$B$5:$B$21,1,FALSE)),WEEKDAY(B32,2),\"Feiertag\")","v":7},{"$f":"S31+IF(F32=\"Z\",-(#REF!*24),IF(G32=\"\",0,(O32+P32-D32)*24))","v":0}]
[null,"2023-10-23","Mo",{"$f":"IF(OR(E33=\"F\",F33=\"U\",F33=\"AU\"),'meine Daten'!$C$12,IF(C33=\"Mo\",'meine Daten'!$M$13,IF(C33=\"Di\",'meine Daten'!$M$14,IF(C33=\"Mi\",'meine Daten'!$M$15,IF(C33=\"Do\",'meine Daten'!$M$16,IF(C33=\"Fr\",'meine Daten'!$M$17,IF(C33=\"Sa\",'meine Daten'!$M$18,IF(C33=\"So\",'meine Daten'!$M$19))))))))","v":"08:00:00"},"",null,null,null,"00:00:00",null,null,null,null,"00:00:00","00:00:00",null," ",{"$f":"IF(ISERROR(VLOOKUP(B33,Feiertage!$B$5:$B$21,1,FALSE)),WEEKDAY(B33,2),\"Feiertag\")","v":1},{"$f":"S32+IF(F33=\"Z\",-(#REF!*24),IF(G33=\"\",0,(O33+P33-D33)*24))","v":0}]
[null,"2023-10-24","Di",{"$f":"IF(OR(E34=\"F\",F34=\"U\",F34=\"AU\"),'meine Daten'!$C$12,IF(C34=\"Mo\",'meine Daten'!$M$13,IF(C34=\"Di\",'meine Daten'!$M$14,IF(C34=\"Mi\",'meine Daten'!$M$15,IF(C34=\"Do\",'meine Daten'!$M$16,IF(C34=\"Fr\",'meine Daten'!$M$17,IF(C34=\"Sa\",'meine Daten'!$M$18,IF(C34=\"So\",'meine Daten'!$M$19))))))))","v":"08:00:00"},"",null,null,null,"00:00:00",null,null,null,null,"00:00:00","00:00:00",null," ",{"$f":"IF(ISERROR(VLOOKUP(B34,Feiertage!$B$5:$B$21,1,FALSE)),WEEKDAY(B34,2),\"Feiertag\")","v":2},{"$f":"S33+IF(F34=\"Z\",-(#REF!*24),IF(G34=\"\",0,(O34+P34-D34)*24))","v":0}]
[null,"2023-10-25","Mi",{"$f":"IF(OR(E35=\"F\",F35=\"U\",F35=\"AU\"),'meine Daten'!$C$12,IF(C35=\"Mo\",'meine Daten'!$M$13,IF(C35=\"Di\",'meine Daten'!$M$14,IF(C35=\"Mi\",'meine Daten'!$M$15,IF(C35=\"Do\",'meine Daten'!$M$16,IF(C35=\"Fr\",'meine Daten'!$M$17,IF(C35=\"Sa\",'meine Daten'!$M$18,IF(C35=\"So\",'meine Daten'!$M$19))))))))","v":"08:00:00"},"",null,null,null,"00:00:00",null,null,null,null,"00:00:00","00:00:00",null," ",{"$f":"IF(ISERROR(VLOOKUP(B35,Feiertage!$B$5:$B$21,1,FALSE)),WEEKDAY(B35,2),\"Feiertag\")","v":3},{"$f":"S34+IF(F35=\"Z\",-(#REF!*24),IF(G35=\"\",0,(O35+P35-D35)*24))","v":0}]
[null,"2023-10-26","Do",{"$f":"IF(OR(E36=\"F\",F36=\"U\",F36=\"AU\"),'meine Daten'!$C$12,IF(C36=\"Mo\",'meine Daten'!$M$13,IF(C36=\"Di\",'meine Daten'!$M$14,IF(C36=\"Mi\",'meine Daten'!$M$15,IF(C36=\"Do\",'meine Daten'!$M$16,IF(C36=\"Fr\",'meine Daten'!$M$17,IF(C36=\"Sa\",'meine Daten'!$M$18,IF(C36=\"So\",'meine Daten'!$M$19))))))))","v":"08:00:00"},"",null,null,null,"00:00:00",null,null,null,null,"00:00:00","00:00:00",null," ",{"$f":"IF(ISERROR(VLOOKUP(B36,Feiertage!$B$5:$B$21,1,FALSE)),WEEKDAY(B36,2),\"Feiertag\")","v":4},{"$f":"S35+IF(F36=\"Z\",-(#REF!*24),IF(G36=\"\",0,(O36+P36-D36)*24))","v":0}]
[null,"2023-10-27","Fr",{"$f":"IF(OR(E37=\"F\",F37=\"U\",F37=\"AU\"),'meine Daten'!$C$12,IF(C37=\"Mo\",'meine Daten'!$M$13,IF(C37=\"Di\",'meine Daten'!$M$14,IF(C37=\"Mi\",'meine Daten'!$M$15,IF(C37=\"Do\",'meine Daten'!$M$16,IF(C37=\"Fr\",'meine Daten'!$M$17,IF(C37=\"Sa\",'meine Daten'!$M$18,IF(C37=\"So\",'meine Daten'!$M$19))))))))","v":"08:00:00"},"",null,null,null,"00:00:00",null,null,null,null,"00:00:00","00:00:00",null," ",{"$f":"IF(ISERROR(VLOOKUP(B37,Feiertage!$B$5:$B$21,1,FALSE)),WEEKDAY(B37,2),\"Feiertag\")","v":5},{"$f":"S36+IF(F37=\"Z\",-(#REF!*24),IF(G37=\"\",0,(O37+P37-D37)*24))","v":0}]
[null,"2023-10-28","Sa",{"$f":"IF(OR(E38=\"F\",F38=\"U\",F38=\"AU\"),'meine Daten'!$C$12,IF(C38=\"Mo\",'meine Daten'!$M$13,IF(C38=\"Di\",'meine Daten'!$M$14,IF(C38=\"Mi\",'meine Daten'!$M$15,IF(C38=\"Do\",'meine Daten'!$M$16,IF(C38=\"Fr\",'meine Daten'!$M$17,IF(C38=\"Sa\",'meine Daten'!$M$18,IF(C38=\"So\",'meine Daten'!$M$19))))))))","v":"00:00:00"},"",null,null,null,"00:00:00",null,null,null,null,"00:00:00","00:00:00",null," ",{"$f":"IF(ISERROR(VLOOKUP(B38,Feiertage!$B$5:$B$21,1,FALSE)),WEEKDAY(B38,2),\"Feiertag\")","v":6},{"$f":"S37+IF(F38=\"Z\",-(#REF!*24),IF(G38=\"\",0,(O38+P38-D38)*24))","v":0},null,null,"Ich versichere die Richtigkeit meiner Angaben. Mir ist bekannt, "]
[null,"2023-10-29","So",{"$f":"IF(OR(E39=\"F\",F39=\"U\",F39=\"AU\"),'meine Daten'!$C$12,IF(C39=\"Mo\",'meine Daten'!$M$13,IF(C39=\"Di\",'meine Daten'!$M$14,IF(C39=\"Mi\",'meine Daten'!$M$15,IF(C39=\"Do\",'meine Daten'!$M$16,IF(C39=\"Fr\",'meine Daten'!$M$17,IF(C39=\"Sa\",'meine Daten'!$M$18,IF(C39=\"So\",'meine Daten'!$M$19))))))))","v":"00:00:00"},"",null,null,null,"00:00:00",null,null,null,null,"00:00:00","00:00:00",null," ",{"$f":"IF(ISERROR(VLOOKUP(B39,Feiertage!$B$5:$B$21,1,FALSE)),WEEKDAY(B39,2),\"Feiertag\")","v":7},{"$f":"S38+IF(F39=\"Z\",-(#REF!*24),IF(G39=\"\",0,(O39+P39-D39)*24))","v":0},null,null,"dass unrichtige Angaben eine grobe Pflichtverletzung darstellen. "]
[null,"2023-10-30","Mo",{"$f":"IF(OR(E40=\"F\",F40=\"U\",F40=\"AU\"),'meine Daten'!$C$12,IF(C40=\"Mo\",'meine Daten'!$M$13,IF(C40=\"Di\",'meine Daten'!$M$14,IF(C40=\"Mi\",'meine Daten'!$M$15,IF(C40=\"Do\",'meine Daten'!$M$16,IF(C40=\"Fr\",'meine Daten'!$M$17,IF(C40=\"Sa\",'meine Daten'!$M$18,IF(C40=\"So\",'meine Daten'!$M$19))))))))","v":"08:00:00"},"",null,null,null,"00:00:00",null,null,null,null,"00:00:00","00:00:00",null," ",{"$f":"IF(ISERROR(VLOOKUP(B40,Feiertage!$B$5:$B$21,1,FALSE)),WEEKDAY(B40,2),\"Feiertag\")","v":1},{"$f":"S39+IF(F40=\"Z\",-(#REF!*24),IF(G40=\"\",0,(O40+P40-D40)*24))","v":0}]
[null,"2023-10-31","Di",{"$f":"IF(OR(E41=\"F\",F41=\"U\",F41=\"AU\"),'meine Daten'!$C$12,IF(C41=\"Mo\",'meine Daten'!$M$13,IF(C41=\"Di\",'meine Daten'!$M$14,IF(C41=\"Mi\",'meine Daten'!$M$15,IF(C41=\"Do\",'meine Daten'!$M$16,IF(C41=\"Fr\",'meine Daten'!$M$17,IF(C41=\"Sa\",'meine Daten'!$M$18,IF(C41=\"So\",'meine Daten'!$M$19))))))))","v":"08:00:00"},null,null,null,null,"00:00:00",null,null,null,null,"00:00:00","00:00:00",null," ",{"$f":"IF(ISERROR(VLOOKUP(B41,Feiertage!$B$5:$B$21,1,FALSE)),WEEKDAY(B41,2),\"Feiertag\")","v":2},{"$f":"S40+IF(F41=\"Z\",-(#REF!*24),IF(G41=\"\",0,(O41+P41-D41)*24))","v":0}]
[null,null,null,null,null,{"$f":"COUNTIF(F13:F41,\"U\")+COUNTIF(F13:F41,\"Z\")+COUNTIF(F13:F41,AU)","v":0},{"$f":"IF(SUM(G13:G41)<=0,0,1)","v":0},null,null,null,null,null,null,null,null,null,{"$f":"SUM(Q11:Q41)","v":0}]
[null,null,null,null,null,null,null,null,null,null,null,null,null,"Monatssaldo:",null,null,{"$f":"IF(F42+G42=0,\"\",SUM(Q11:Q41))","v":""}]
[null,null,null,null,null,null,null,null,null,null,null,null,null,"Gleitzeitkontostand:",null,null,{"$f":"IF(OR(Q10=\"\",Q43=\"\"),\"\",Q10+Q43)","v":""},null,null,null,null,"Datum, Unterschrift"]
[null,null,null,null,null,null,null,null,null,null,null,null,null,"(In Stunden:Minuten)"]
[null,null,null,null,null,null,null,null,null,null,null,null,null,null,null,null,null,null,null,null,null,null,"„Der Arbeitszeit-Checker“ von Simone Back für www.arbeitszeit-klug-gestalten.de "]
[null,null,null,null,null,null,null,null,null,null,null,null,null,"Urlaubstage",null,null,{"$f":"COUNTIF(F11:F41,\"U\")","v":0}]
[null,null,null,null,null,null,null,null,null,null,null,null,null,null,null,null,null,null,null,null,null,null,"ist lizensiert unter einer Creative Commons Lizenz CC BY SA 4.0 \n(Nutzung bei Namensnennung, Weitergabe unter gleichen Bedingungen)"]
[null,null,null,null,null,null,null,null,null,null,null,null,null,null,null,null,null,null,null,null,null,"Copyright für das Logo \"Arbeitszeit klug gestalten\": RKW Hessen. Das Logo darf nur für den Checker in der Ursprungsform genutzt werden."]

{"sheet":"Nov","index":12,"n_rows":50,"n_cols":24,"rows_kept":50,"cut":false,"hidden":false,"merged":[[9,1,9,15],[46,1,46,2],[5,22,6,25],[3,15,3,16],[6,1,8,1],[6,2,8,2],[6,3,8,3],[6,4,8,4],[6,5,8,5],[6,15,7,15],[7,9,7,10],[7,11,7,12],[46,22,47,25],[48,22,48,25],[49,21,50,25],[3,22,4,25],[42,20,42,21],[45,20,45,21]]}
[null,"Arbeitszeit-Nachweis",null,null,null,null,null,"Name:",null,{"$f":"IF('meine Daten'!C3=\"\",\"\",'meine Daten'!C3)","v":""},null,null,null,null,null,null,null,null,{"$f":"B11","v":"2023-11-01"},{"$f":"B11","v":"2023-11-01"}]
[]
[null,null,null,null,"Symbol* :  ","U","=Urlaub"]
[null,null,null,null,null,"AU","=Krank/Kur",null,null,null,null,null,null,null,"bedeutet:","Eintrag fehlt "]
[null,null,null,null,null,"Z","Zeitausgleich (ganzer Tag)",null,null,null,null,null,null,null,"bedeutet:","mehr als 10 Stunden"]
[]
[null,"Datum","Tag","Sollzeit","Feiertag","Symbol *","Brutto-Arbeitszeit",null,null,"Pausen",null,null,null,null,"Netto","weitere\nReisezeit","Saldo"]
[null,null,null,null,null,null,null,null,null,"Mittag",null,"weitere\n(Std:Min)",null,"Summe","Arbeits-\nzeit",null,"Arbeits-\nzeit"]
[null,null,null,null,null,null,"von","bis","Std:Min","von","bis","I","II","./.Std:Min","Std:Min","Std:Min","Std:Min",null,null,"Bemerkung"]
[null,"Übertrag vom Vormonat: ",null,null,null,null,null,null,null,null,null,null,null,null,null,null,{"$f":"Okt!Q44","v":""}]
[null,{"$f":"Okt!B41+1","v":"2023-11-01"},{"$f":"TEXT(B11,\"TTT\")","v":"Mi"},{"$f":"IF(OR(E11=\"F\",F11=\"U\",F11=\"AU\"),'meine Daten'!$C$12,IF(C11=\"Mo\",'meine Daten'!$M$21,IF(C11=\"Di\",'meine Daten'!$M$22,IF(C11=\"Mi\",'meine Daten'!$M$23,IF(C11=\"Do\",'meine Daten'!$M$24,IF(C11=\"Fr\",'meine Daten'!$M$25,IF(C11=\"Sa\",'meine Daten'!$M$26,IF(C11=\"So\",'meine Daten'!$M$27))))))))","v":"08:00:00"},{"$f":"IF(R11=\"Feiertag\",\"F\",\"\")","v":""},null,null,null,{"$f":"H11-G11","v":"00:00:00"},null,null,null,null,{"$f":"K11-J11+L11+M11","v":"00:00:00"},{"$f":"I11-N11","v":"00:00:00"},null,{"$f":"IF(F11=\"Z\",-(D11),IF(G11=\"\",\" \",IF(O11+P11>D11,O11+P11-D11,IF(O11+P11<D11,-(D11-O11-P11),\" \"))))","v":" "},{"$f":"IF(ISERROR(VLOOKUP(B11,Feiertage!$B$5:$B$21,1,FALSE)),WEEKDAY(B11,2),\"Feiertag\")","v":3},{"$f":"IF(G11=\"\",0,(O11+P11-D11)*24)","v":0}]
[null,{"$f":"B11+1","v":"2023-11-02"},{"$f":"TEXT(B12,\"TTT\")","v":"Do"},{"$f":"IF(OR(E12=\"F\",F12=\"U\",F12=\"AU\"),'meine Daten'!$C$12,IF(C12=\"Mo\",'meine Daten'!$M$21,IF(C12=\"Di\",'meine Daten'!$M$22,IF(C12=\"Mi\",'meine Daten'!$M$23,IF(C12=\"Do\",'meine Daten'!$M$24,IF(C12=\"Fr\",'meine Daten'!$M$25,IF(C12=\"Sa\",'meine Daten'!$M$26,IF(C12=\"So\",'meine Daten'!$M$27))))))))","v":"08:00:00"},"",null,null,null,{"$f":"H12-G12","v":"00:00:00"},null,null,null,null,{"$f":"K12-J12+L12+M12","v":"00:00:00"},"00:00:00",null,{"$f":"IF(F12=\"Z\",-(D12),IF(G12=\"\",\" \",IF(O12+P12>D12,O12+P12-D12,IF(O12+P12<D12,-(D12-O12-P12),\" \"))))","v":" "},{"$f":"IF(ISERROR(VLOOKUP(B12,Feiertage!$B$5:$B$21,1,FALSE)),WEEKDAY(B12,2),\"Feiertag\")","v":4},{"$f":"S11+IF(F12=\"Z\",-(#REF!*24),IF(G12=\"\",0,(O12+P12-D12)*24))","v":0}]
[null,{"$f":"B12+1","v":"2023-11-03"},"Fr",{"$f":"IF(OR(E13=\"F\",F13=\"U\",F13=\"AU\"),'meine Daten'!$C$12,IF(C13=\"Mo\",'meine Daten'!$M$21,IF(C13=\"Di\",'meine Daten'!$M$22,IF(C13=\"Mi\",'meine Daten'!$M$23,IF(C13=\"Do\",'meine Daten'!$M$24,IF(C13=\"Fr\",'meine Daten'!$M$25,IF(C13=\"Sa\",'meine Daten'!$M$26,IF(C13=\"So\",'meine Daten'!$M$27))))))))","v":"08:00:00"},"",null,null,null,{"$f":"H13-G13","v":"00:00:00"},null,null,null,null,"00:00:00","00:00:00",null," ",{"$f":"IF(ISERROR(VLOOKUP(B13,Feiertage!$B$5:$B$21,1,FALSE)),WEEKDAY(B13,2),\"Feiertag\")","v":5},{"$f":"S12+IF(F13=\"Z\",-(#REF!*24),IF(G13=\"\",0,(O13+P13-D13)*24))","v":0}]
[null,{"$f":"B13+1","v":"2023-11-04"},"Sa",{"$f":"IF(OR(E14=\"F\",F14=\"U\",F14=\"AU\"),'meine Daten'!$C$12,IF(C14=\"Mo\",'meine Daten'!$M$21,IF(C14=\"Di\",'meine Daten'!$M$22,IF(C14=\"Mi\",'meine Daten'!$M$23,IF(C14=\"Do\",'meine Daten'!$M$24,IF(C14=\"Fr\",'meine Daten'!$M$25,IF(C14=\"Sa\",'meine Daten'!$M$26,IF(C14=\"So\",'meine Daten'!$M$27))))))))","v":"00:00:00"},"",null,null,null,"00:00:00",null,null,null,null,"00:00:00","00:00:00",null," ",{"$f":"IF(ISERROR(VLOOKUP(B14,Feiertage!$B$5:$B$21,1,FALSE)),WEEKDAY(B14,2),\"Feiertag\")","v":6},{"$f":"S13+IF(F14=\"Z\",-(#REF!*24),IF(G14=\"\",0,(O14+P14-D14)*24))","v":0}]
[null,"2023-11-05","So",{"$f":"IF(OR(E15=\"F\",F15=\"U\",F15=\"AU\"),'meine Daten'!$C$12,IF(C15=\"Mo\",'meine Daten'!$M$21,IF(C15=\"Di\",'meine Daten'!$M$22,IF(C15=\"Mi\",'meine Daten'!$M$23,IF(C15=\"Do\",'meine Daten'!$M$24,IF(C15=\"Fr\",'meine Daten'!$M$25,IF(C15=\"Sa\",'meine Daten'!$M$26,IF(C15=\"So\",'meine Daten'!$M$27))))))))","v":"00:00:00"},"",null,null,null,"00:00:00",null,null,null,null,"00:00:00","00:00:00",null," ",{"$f":"IF(ISERROR(VLOOKUP(B15,Feiertage!$B$5:$B$21,1,FALSE)),WEEKDAY(B15,2),\"Feiertag\")","v":7},{"$f":"S14+IF(F15=\"Z\",-(#REF!*24),IF(G15=\"\",0,(O15+P15-D15)*24))","v":0}]
[null,"2023-11-06","Mo",{"$f":"IF(OR(E16=\"F\",F16=\"U\",F16=\"AU\"),'meine Daten'!$C$12,IF(C16=\"Mo\",'meine Daten'!$M$21,IF(C16=\"Di\",'meine Daten'!$M$22,IF(C16=\"Mi\",'meine Daten'!$M$23,IF(C16=\"Do\",'meine Daten'!$M$24,IF(C16=\"Fr\",'meine Daten'!$M$25,IF(C16=\"Sa\",'meine Daten'!$M$26,IF(C16=\"So\",'meine Daten'!$M$27))))))))","v":"08:00:00"},"",null,null,null,"00:00:00",null,null,null,null,"00:00:00","00:00:00",null," ",{"$f":"IF(ISERROR(VLOOKUP(B16,Feiertage!$B$5:$B$21,1,FALSE)),WEEKDAY(B16,2),\"Feiertag\")","v":1},{"$f":"S15+IF(F16=\"Z\",-(#REF!*24),IF(G16=\"\",0,(O16+P16-D16)*24))","v":0}]
[null,"2023-11-07","Di",{"$f":"IF(OR(E17=\"F\",F17=\"U\",F17=\"AU\"),'meine Daten'!$C$12,IF(C17=\"Mo\",'meine Daten'!$M$21,IF(C17=\"Di\",'meine Daten'!$M$22,IF(C17=\"Mi\",'meine Daten'!$M$23,IF(C17=\"Do\",'meine Daten'!$M$24,IF(C17=\"Fr\",'meine Daten'!$M$25,IF(C17=\"Sa\",'meine Daten'!$M$26,IF(C17=\"So\",'meine Daten'!$M$27))))))))","v":"08:00:00"},"",null,null,null,"00:00:00",null,null,null,null,"00:00:00","00:00:00",null," ",{"$f":"IF(ISERROR(VLOOKUP(B17,Feiertage!$B$5:$B$21,1,FALSE)),WEEKDAY(B17,2),\"Feiertag\")","v":2},{"$f":"S16+IF(F17=\"Z\",-(#REF!*24),IF(G17=\"\",0,(O17+P17-D17)*24))","v":0}]
[null,"2023-11-08","Mi",{"$f":"IF(OR(E18=\"F\",F18=\"U\",F18=\"AU\"),'meine Daten'!$C$12,IF(C18=\"Mo\",'meine Daten'!$M$21,IF(C18=\"Di\",'meine Daten'!$M$22,IF(C18=\"Mi\",'meine Daten'!$M$23,IF(C18=\"Do\",'meine Daten'!$M$24,IF(C18=\"Fr\",'meine Daten'!$M$25,IF(C18=\"Sa\",'meine Daten'!$M$26,IF(C18=\"So\",'meine Daten'!$M$27))))))))","v":"08:00:00"},"",null,null,null,"00:00:00",null,null,null,null,"00:00:00","00:00:00",null," ",{"$f":"IF(ISERROR(VLOOKUP(B18,Feiertage!$B$5:$B$21,1,FALSE)),WEEKDAY(B18,2),\"Feiertag\")","v":3},{"$f":"S17+IF(F18=\"Z\",-(#REF!*24),IF(G18=\"\",0,(O18+P18-D18)*24))","v":0}]
[null,"2023-11-09","Do",{"$f":"IF(OR(E19=\"F\",F19=\"U\",F19=\"AU\"),'meine Daten'!$C$12,IF(C19=\"Mo\",'meine Daten'!$M$21,IF(C19=\"Di\",'meine Daten'!$M$22,IF(C19=\"Mi\",'meine Daten'!$M$23,IF(C19=\"Do\",'meine Daten'!$M$24,IF(C19=\"Fr\",'meine Daten'!$M$25,IF(C19=\"Sa\",'meine Daten'!$M$26,IF(C19=\"So\",'meine Daten'!$M$27))))))))","v":"08:00:00"},"",null,null,null,"00:00:00",null,null,null,null,"00:00:00","00:00:00",null," ",{"$f":"IF(ISERROR(VLOOKUP(B19,Feiertage!$B$5:$B$21,1,FALSE)),WEEKDAY(B19,2),\"Feiertag\")","v":4},{"$f":"S18+IF(F19=\"Z\",-(#REF!*24),IF(G19=\"\",0,(O19+P19-D19)*24))","v":0}]
[null,"2023-11-10","Fr",{"$f":"IF(OR(E20=\"F\",F20=\"U\",F20=\"AU\"),'meine Daten'!$C$12,IF(C20=\"Mo\",'meine Daten'!$M$21,IF(C20=\"Di\",'meine Daten'!$M$22,IF(C20=\"Mi\",'meine Daten'!$M$23,IF(C20=\"Do\",'meine Daten'!$M$24,IF(C20=\"Fr\",'meine Daten'!$M$25,IF(C20=\"Sa\",'meine Daten'!$M$26,IF(C20=\"So\",'meine Daten'!$M$27))))))))","v":"08:00:00"},"",null,null,null,"00:00:00",null,null,null,null,"00:00:00","00:00:00",null," ",{"$f":"IF(ISERROR(VLOOKUP(B20,Feiertage!$B$5:$B$21,1,FALSE)),WEEKDAY(B20,2),\"Feiertag\")","v":5},{"$f":"S19+IF(F20=\"Z\",-(#REF!*24),IF(G20=\"\",0,(O20+P20-D20)*24))","v":0}]
[null,"2023-11-11","Sa",{"$f":"IF(OR(E21=\"F\",F21=\"U\",F21=\"AU\"),'meine Daten'!$C$12,IF(C21=\"Mo\",'meine Daten'!$M$21,IF(C21=\"Di\",'meine Daten'!$M$22,IF(C21=\"Mi\",'meine Daten'!$M$23,IF(C21=\"Do\",'meine Daten'!$M$24,IF(C21=\"Fr\",'meine Daten'!$M$25,IF(C21=\"Sa\",'meine Daten'!$M$26,IF(C21=\"So\",'meine Daten'!$M$27))))))))","v":"00:00:00"},"",null,null,null,"00:00:00",null,null,null,null,"00:00:00","00:00:00",null," ",{"$f":"IF(ISERROR(VLOOKUP(B21,Feiertage!$B$5:$B$21,1,FALSE)),WEEKDAY(B21,2),\"Feiertag\")","v":6},{"$f":"S20+IF(F21=\"Z\",-(#REF!*24),IF(G21=\"\",0,(O21+P21-D21)*24))","v":0}]
[null,"2023-11-12","So",{"$f":"IF(OR(E22=\"F\",F22=\"U\",F22=\"AU\"),'meine Daten'!$C$12,IF(C22=\"Mo\",'meine Daten'!$M$21,IF(C22=\"Di\",'meine Daten'!$M$22,IF(C22=\"Mi\",'meine Daten'!$M$23,IF(C22=\"Do\",'meine Daten'!$M$24,IF(C22=\"Fr\",'meine Daten'!$M$25,IF(C22=\"Sa\",'meine Daten'!$M$26,IF(C22=\"So\",'meine Daten'!$M$27))))))))","v":"00:00:00"},"",null,null,null,"00:00:00",null,null,null,null,"00:00:00","00:00:00",null," ",{"$f":"IF(ISERROR(VLOOKUP(B22,Feiertage!$B$5:$B$21,1,FALSE)),WEEKDAY(B22,2),\"Feiertag\")","v":7},{"$f":"S21+IF(F22=\"Z\",-(#REF!*24),IF(G22=\"\",0,(O22+P22-D22)*24))","v":0}]
[null,"2023-11-13","Mo",{"$f":"IF(OR(E23=\"F\",F23=\"U\",F23=\"AU\"),'meine Daten'!$C$12,IF(C23=\"Mo\",'meine Daten'!$M$21,IF(C23=\"Di\",'meine Daten'!$M$22,IF(C23=\"Mi\",'meine Daten'!$M$23,IF(C23=\"Do\",'meine Daten'!$M$24,IF(C23=\"Fr\",'meine Daten'!$M$25,IF(C23=\"Sa\",'meine Daten'!$M$26,IF(C23=\"So\",'meine Daten'!$M$27))))))))","v":"08:00:00"},"",null,null,null,"00:00:00",null,null,null,null,"00:00:00","00:00:00",null," ",{"$f":"IF(ISERROR(VLOOKUP(B23,Feiertage!$B$5:$B$21,1,FALSE)),WEEKDAY(B23,2),\"Feiertag\")","v":1},{"$f":"S22+IF(F23=\"Z\",-(#REF!*24),IF(G23=\"\",0,(O23+P23-D23)*24))","v":0}]
[null,"2023-11-14","Di",{"$f":"IF(OR(E24=\"F\",F24=\"U\",F24=\"AU\"),'meine Daten'!$C$12,IF(C24=\"Mo\",'meine Daten'!$M$21,IF(C24=\"Di\",'meine Daten'!$M$22,IF(C24=\"Mi\",'meine Daten'!$M$23,IF(C24=\"Do\",'meine Daten'!$M$24,IF(C24=\"Fr\",'meine Daten'!$M$25,IF(C24=\"Sa\",'meine Daten'!$M$26,IF(C24=\"So\",'meine Daten'!$M$27))))))))","v":"08:00:00"},"",null,null,null,"00:00:00",null,null,null,null,"00:00:00","00:00:00",null," ",{"$f":"IF(ISERROR(VLOOKUP(B24,Feiertage!$B$5:$B$21,1,FALSE)),WEEKDAY(B24,2),\"Feiertag\")","v":2},{"$f":"S23+IF(F24=\"Z\",-(#REF!*24),IF(G24=\"\",0,(O24+P24-D24)*24))","v":0}]
[null,"2023-11-15","Mi",{"$f":"IF(OR(E25=\"F\",F25=\"U\",F25=\"AU\"),'meine Daten'!$C$12,IF(C25=\"Mo\",'meine Daten'!$M$21,IF(C25=\"Di\",'meine Daten'!$M$22,IF(C25=\"Mi\",'meine Daten'!$M$23,IF(C25=\"Do\",'meine Daten'!$M$24,IF(C25=\"Fr\",'meine Daten'!$M$25,IF(C25=\"Sa\",'meine Daten'!$M$26,IF(C25=\"So\",'meine Daten'!$M$27))))))))","v":"08:00:00"},"",null,null,null,"00:00:00",null,null,null,null,"00:00:00","00:00:00",null," ",{"$f":"IF(ISERROR(VLOOKUP(B25,Feiertage!$B$5:$B$21,1,FALSE)),WEEKDAY(B25,2),\"Feiertag\")","v":3},{"$f":"S24+IF(F25=\"Z\",-(#REF!*24),IF(G25=\"\",0,(O25+P25-D25)*24))","v":0}]
[null,"2023-11-16","Do",{"$f":"IF(OR(E26=\"F\",F26=\"U\",F26=\"AU\"),'meine Daten'!$C$12,IF(C26=\"Mo\",'meine Daten'!$M$21,IF(C26=\"Di\",'meine Daten'!$M$22,IF(C26=\"Mi\",'meine Daten'!$M$23,IF(C26=\"Do\",'meine Daten'!$M$24,IF(C26=\"Fr\",'meine Daten'!$M$25,IF(C26=\"Sa\",'meine Daten'!$M$26,IF(C26=\"So\",'meine Daten'!$M$27))))))))","v":"08:00:00"},"",null,null,null,"00:00:00",null,null,null,null,"00:00:00","00:00:00",null," ",{"$f":"IF(ISERROR(VLOOKUP(B26,Feiertage!$B$5:$B$21,1,FALSE)),WEEKDAY(B26,2),\"Feiertag\")","v":4},{"$f":"S25+IF(F26=\"Z\",-(#REF!*24),IF(G26=\"\",0,(O26+P26-D26)*24))","v":0}]
[null,"2023-11-17","Fr",{"$f":"IF(OR(E27=\"F\",F27=\"U\",F27=\"AU\"),'meine Daten'!$C$12,IF(C27=\"Mo\",'meine Daten'!$M$21,IF(C27=\"Di\",'meine Daten'!$M$22,IF(C27=\"Mi\",'meine Daten'!$M$23,IF(C27=\"Do\",'meine Daten'!$M$24,IF(C27=\"Fr\",'meine Daten'!$M$25,IF(C27=\"Sa\",'meine Daten'!$M$26,IF(C27=\"So\",'meine Daten'!$M$27))))))))","v":"08:00:00"},"",null,null,null,"00:00:00",null,null,null,null,"00:00:00","00:00:00",null," ",{"$f":"IF(ISERROR(VLOOKUP(B27,Feiertage!$B$5:$B$21,1,FALSE)),WEEKDAY(B27,2),\"Feiertag\")","v":5},{"$f":"S26+IF(F27=\"Z\",-(#REF!*24),IF(G27=\"\",0,(O27+P27-D27)*24))","v":0}]
[null,"2023-11-18","Sa",{"$f":"IF(OR(E28=\"F\",F28=\"U\",F28=\"AU\"),'meine Daten'!$C$12,IF(C28=\"Mo\",'meine Daten'!$M$21,IF(C28=\"Di\",'meine Daten'!$M$22,IF(C28=\"Mi\",'meine Daten'!$M$23,IF(C28=\"Do\",'meine Daten'!$M$24,IF(C28=\"Fr\",'meine Daten'!$M$25,IF(C28=\"Sa\",'meine Daten'!$M$26,IF(C28=\"So\",'meine Daten'!$M$27))))))))","v":"00:00:00"},"",null,null,null,"00:00:00",null,null,null,null,"00:00:00","00:00:00",null," ",{"$f":"IF(ISERROR(VLOOKUP(B28,Feiertage!$B$5:$B$21,1,FALSE)),WEEKDAY(B28,2),\"Feiertag\")","v":6},{"$f":"S27+IF(F28=\"Z\",-(#REF!*24),IF(G28=\"\",0,(O28+P28-D28)*24))","v":0}]
[null,"2023-11-19","So",{"$f":"IF(OR(E29=\"F\",F29=\"U\",F29=\"AU\"),'meine Daten'!$C$12,IF(C29=\"Mo\",'meine Daten'!$M$21,IF(C29=\"Di\",'meine Daten'!$M$22,IF(C29=\"Mi\",'meine Daten'!$M$23,IF(C29=\"Do\",'meine Daten'!$M$24,IF(C29=\"Fr\",'meine Daten'!$M$25,IF(C29=\"Sa\",'meine Daten'!$M$26,IF(C29=\"So\",'meine Daten'!$M$27))))))))","v":"00:00:00"},"",null,null,null,"00:00:00",null,null,null,null,"00:00:00","00:00:00",null," ",{"$f":"IF(ISERROR(VLOOKUP(B29,Feiertage!$B$5:$B$21,1,FALSE)),WEEKDAY(B29,2),\"Feiertag\")","v":7},{"$f":"S28+IF(F29=\"Z\",-(#REF!*24),IF(G29=\"\",0,(O29+P29-D29)*24))","v":0}]
[null,"2023-11-20","Mo",{"$f":"IF(OR(E30=\"F\",F30=\"U\",F30=\"AU\"),'meine Daten'!$C$12,IF(C30=\"Mo\",'meine Daten'!$M$21,IF(C30=\"Di\",'meine Daten'!$M$22,IF(C30=\"Mi\",'meine Daten'!$M$23,IF(C30=\"Do\",'meine Daten'!$M$24,IF(C30=\"Fr\",'meine Daten'!$M$25,IF(C30=\"Sa\",'meine Daten'!$M$26,IF(C30=\"So\",'meine Daten'!$M$27))))))))","v":"08:00:00"},"",null,null,null,"00:00:00",null,null,null,null,"00:00:00","00:00:00",null," ",{"$f":"IF(ISERROR(VLOOKUP(B30,Feiertage!$B$5:$B$21,1,FALSE)),WEEKDAY(B30,2),\"Feiertag\")","v":1},{"$f":"S29+IF(F30=\"Z\",-(#REF!*24),IF(G30=\"\",0,(O30+P30-D30)*24))","v":0}]
[null,"2023-11-21","Di",{"$f":"IF(OR(E31=\"F\",F31=\"U\",F31=\"AU\"),'meine Daten'!$C$12,IF(C31=\"Mo\",'meine Daten'!$M$21,IF(C31=\"Di\",'meine Daten'!$M$22,IF(C31=\"Mi\",'meine Daten'!$M$23,IF(C31=\"Do\",'meine Daten'!$M$24,IF(C31=\"Fr\",'meine Daten'!$M$25,IF(C31=\"Sa\",'meine Daten'!$M$26,IF(C31=\"So\",'meine Daten'!$M$27))))))))","v":"08:00:00"},"",null,null,null,"00:00:00",null,null,null,null,"00:00:00","00:00:00",null," ",{"$f":"IF(ISERROR(VLOOKUP(B31,Feiertage!$B$5:$B$21,1,FALSE)),WEEKDAY(B31,2),\"Feiertag\")","v":2},{"$f":"S30+IF(F31=\"Z\",-(#REF!*24),IF(G31=\"\",0,(O31+P31-D31)*24))","v":0}]
[null,"2023-11-22","Mi",{"$f":"IF(OR(E32=\"F\",F32=\"U\",F32=\"AU\"),'meine Daten'!$C$12,IF(C32=\"Mo\",'meine Daten'!$M$21,IF(C32=\"Di\",'meine Daten'!$M$22,IF(C32=\"Mi\",'meine Daten'!$M$23,IF(C32=\"Do\",'meine Daten'!$M$24,IF(C32=\"Fr\",'meine Daten'!$M$25,IF(C32=\"Sa\",'meine Daten'!$M$26,IF(C32=\"So\",'meine Daten'!$M$27))))))))","v":"08:00:00"},"",null,null,null,"00:00:00",null,null,null,null,"00:00:00","00:00:00",null," ",{"$f":"IF(ISERROR(VLOOKUP(B32,Feiertage!$B$5:$B$21,1,FALSE)),WEEKDAY(B32,2),\"Feiertag\")","v":3},{"$f":"S31+IF(F32=\"Z\",-(#REF!*24),IF(G32=\"\",0,(O32+P32-D32)*24))","v":0}]
[null,"2023-11-23","Do",{"$f":"IF(OR(E33=\"F\",F33=\"U\",F33=\"AU\"),'meine Daten'!$C$12,IF(C33=\"Mo\",'meine Daten'!$M$21,IF(C33=\"Di\",'meine Daten'!$M$22,IF(C33=\"Mi\",'meine Daten'!$M$23,IF(C33=\"Do\",'meine Daten'!$M$24,IF(C33=\"Fr\",'meine Daten'!$M$25,IF(C33=\"Sa\",'meine Daten'!$M$26,IF(C33=\"So\",'meine Daten'!$M$27))))))))","v":"08:00:00"},"",null,null,null,"00:00:00",null,null,null,null,"00:00:00","00:00:00",null," ",{"$f":"IF(ISERROR(VLOOKUP(B33,Feiertage!$B$5:$B$21,1,FALSE)),WEEKDAY(B33,2),\"Feiertag\")","v":4},{"$f":"S32+IF(F33=\"Z\",-(#REF!*24),IF(G33=\"\",0,(O33+P33-D33)*24))","v":0}]
[null,"2023-11-24","Fr",{"$f":"IF(OR(E34=\"F\",F34=\"U\",F34=\"AU\"),'meine Daten'!$C$12,IF(C34=\"Mo\",'meine Daten'!$M$21,IF(C34=\"Di\",'meine Daten'!$M$22,IF(C34=\"Mi\",'meine Daten'!$M$23,IF(C34=\"Do\",'meine Daten'!$M$24,IF(C34=\"Fr\",'meine Daten'!$M$25,IF(C34=\"Sa\",'meine Daten'!$M$26,IF(C34=\"So\",'meine Daten'!$M$27))))))))","v":"08:00:00"},"",null,null,null,"00:00:00",null,null,null,null,"00:00:00","00:00:00",null," ",{"$f":"IF(ISERROR(VLOOKUP(B34,Feiertage!$B$5:$B$21,1,FALSE)),WEEKDAY(B34,2),\"Feiertag\")","v":5},{"$f":"S33+IF(F34=\"Z\",-(#REF!*24),IF(G34=\"\",0,(O34+P34-D34)*24))","v":0}]
[null,"2023-11-25","Sa",{"$f":"IF(OR(E35=\"F\",F35=\"U\",F35=\"AU\"),'meine Daten'!$C$12,IF(C35=\"Mo\",'meine Daten'!$M$21,IF(C35=\"Di\",'meine Daten'!$M$22,IF(C35=\"Mi\",'meine Daten'!$M$23,IF(C35=\"Do\",'meine Daten'!$M$24,IF(C35=\"Fr\",'meine Daten'!$M$25,IF(C35=\"Sa\",'meine Daten'!$M$26,IF(C35=\"So\",'meine Daten'!$M$27))))))))","v":"00:00:00"},"",null,null,null,"00:00:00",null,null,null,null,"00:00:00","00:00:00",null," ",{"$f":"IF(ISERROR(VLOOKUP(B35,Feiertage!$B$5:$B$21,1,FALSE)),WEEKDAY(B35,2),\"Feiertag\")","v":6},{"$f":"S34+IF(F35=\"Z\",-(#REF!*24),IF(G35=\"\",0,(O35+P35-D35)*24))","v":0}]
[null,"2023-11-26","So",{"$f":"IF(OR(E36=\"F\",F36=\"U\",F36=\"AU\"),'meine Daten'!$C$12,IF(C36=\"Mo\",'meine Daten'!$M$21,IF(C36=\"Di\",'meine Daten'!$M$22,IF(C36=\"Mi\",'meine Daten'!$M$23,IF(C36=\"Do\",'meine Daten'!$M$24,IF(C36=\"Fr\",'meine Daten'!$M$25,IF(C36=\"Sa\",'meine Daten'!$M$26,IF(C36=\"So\",'meine Daten'!$M$27))))))))","v":"00:00:00"},"",null,null,null,"00:00:00",null,null,null,null,"00:00:00","00:00:00",null," ",{"$f":"IF(ISERROR(VLOOKUP(B36,Feiertage!$B$5:$B$21,1,FALSE)),WEEKDAY(B36,2),\"Feiertag\")","v":7},{"$f":"S35+IF(F36=\"Z\",-(#REF!*24),IF(G36=\"\",0,(O36+P36-D36)*24))","v":0}]
[null,"2023-11-27","Mo",{"$f":"IF(OR(E37=\"F\",F37=\"U\",F37=\"AU\"),'meine Daten'!$C$12,IF(C37=\"Mo\",'meine Daten'!$M$21,IF(C37=\"Di\",'meine Daten'!$M$22,IF(C37=\"Mi\",'meine Daten'!$M$23,IF(C37=\"Do\",'meine Daten'!$M$24,IF(C37=\"Fr\",'meine Daten'!$M$25,IF(C37=\"Sa\",'meine Daten'!$M$26,IF(C37=\"So\",'meine Daten'!$M$27))))))))","v":"08:00:00"},"",null,null,null,"00:00:00",null,null,null,null,"00:00:00","00:00:00",null," ",{"$f":"IF(ISERROR(VLOOKUP(B37,Feiertage!$B$5:$B$21,1,FALSE)),WEEKDAY(B37,2),\"Feiertag\")","v":1},{"$f":"S36+IF(F37=\"Z\",-(#REF!*24),IF(G37=\"\",0,(O37+P37-D37)*24))","v":0}]
[null,"2023-11-28","Di",{"$f":"IF(OR(E38=\"F\",F38=\"U\",F38=\"AU\"),'meine Daten'!$C$12,IF(C38=\"Mo\",'meine Daten'!$M$21,IF(C38=\"Di\",'meine Daten'!$M$22,IF(C38=\"Mi\",'meine Daten'!$M$23,IF(C38=\"Do\",'meine Daten'!$M$24,IF(C38=\"Fr\",'meine Daten'!$M$25,IF(C38=\"Sa\",'meine Daten'!$M$26,IF(C38=\"So\",'meine Daten'!$M$27))))))))","v":"08:00:00"},"",null,null,null,"00:00:00",null,null,null,null,"00:00:00","00:00:00",null," ",{"$f":"IF(ISERROR(VLOOKUP(B38,Feiertage!$B$5:$B$21,1,FALSE)),WEEKDAY(B38,2),\"Feiertag\")","v":2},{"$f":"S37+IF(F38=\"Z\",-(#REF!*24),IF(G38=\"\",0,(O38+P38-D38)*24))","v":0},null,null,null,"Ich versichere die Richtigkeit meiner Angaben. Mir ist bekannt, "]
[null,"2023-11-29","Mi",{"$f":"IF(OR(E39=\"F\",F39=\"U\",F39=\"AU\"),'meine Daten'!$C$12,IF(C39=\"Mo\",'meine Daten'!$M$21,IF(C39=\"Di\",'meine Daten'!$M$22,IF(C39=\"Mi\",'meine Daten'!$M$23,IF(C39=\"Do\",'meine Daten'!$M$24,IF(C39=\"Fr\",'meine Daten'!$M$25,IF(C39=\"Sa\",'meine Daten'!$M$26,IF(C39=\"So\",'meine Daten'!$M$27))))))))","v":"08:00:00"},"",null,null,null,"00:00:00",null,null,null,null,"00:00:00","00:00:00",null," ",{"$f":"IF(ISERROR(VLOOKUP(B39,Feiertage!$B$5:$B$21,1,FALSE)),WEEKDAY(B39,2),\"Feiertag\")","v":3},{"$f":"S38+IF(F39=\"Z\",-(#REF!*24),IF(G39=\"\",0,(O39+P39-D39)*24))","v":0},null,null,null,"dass unrichtige Angaben eine grobe Pflichtverletzung darstellen. "]
[null,"2023-11-30","Do",{"$f":"IF(OR(E40=\"F\",F40=\"U\",F40=\"AU\"),'meine Daten'!$C$12,IF(C40=\"Mo\",'meine Daten'!$M$21,IF(C40=\"Di\",'meine Daten'!$M$22,IF(C40=\"Mi\",'meine Daten'!$M$23,IF(C40=\"Do\",'meine Daten'!$M$24,IF(C40=\"Fr\",'meine Daten'!$M$25,IF(C40=\"Sa\",'meine Daten'!$M$26,IF(C40=\"So\",'meine Daten'!$M$27))))))))","v":"08:00:00"},null,null,null,null,"00:00:00",null,null,null,null,"00:00:00","00:00:00",null," ",{"$f":"IF(ISERROR(VLOOKUP(B40,Feiertage!$B$5:$B$21,1,FALSE)),WEEKDAY(B40,2),\"Feiertag\")","v":4},{"$f":"#REF!+IF(F40=\"Z\",-(#REF!*24),IF(G40=\"\",0,(O40+P40-D40)*24))","v":{"$error":"#REF!"}}]
[null,null,null,null,null,{"$f":"COUNTIF(F13:F40,\"U\")+COUNTIF(F13:F40,\"Z\")+COUNTIF(F13:F40,AU)","v":0},{"$f":"IF(SUM(G13:G40)<=0,0,1)","v":0},null,null,null,null,null,null,null,null,null,{"$f":"SUM(Q11:Q40)","v":0}]
[null,null,null,null,null,null,null,null,null,null,null,null,null,"Monatssaldo:",null,null,{"$f":"IF(F41+G41=0,\"\",SUM(Q11:Q40))","v":""}]
[null,null,null,null,null,null,null,null,null,null,null,null,null,"Gleitzeitkontostand:",null,null,{"$f":"IF(OR(Q10=\"\",Q42=\"\"),\"\",Q10+Q42)","v":""}]
[null,null,null,null,null,null,null,null,null,null,null,null,null,"(In Stunden:Minuten)",null,null,null,null,null,null,null,null,"Datum","Unterschrift"]
[]
[null,null,null,null,null,null,null,null,null,null,null,null,null,"Urlaubstage",null,null,{"$f":"COUNTIF(F11:F40,\"U\")","v":0}]
[null,null,null,null,null,null,null,null,null,null,null,null,null,null,null,null,null,null,null,null,null,null,"„Der Arbeitszeit-Checker“ von Simone Back für www.arbeitszeit-klug-gestalten.de "]
[]
[null,null,null,null,null,null,null,null,null,null,null,null,null,null,null,null,null,null,null,null,null,null,"ist lizensiert unter einer Creative Commons Lizenz CC BY SA 4.0 \n(Nutzung bei Namensnennung, Weitergabe unter gleichen Bedingungen)"]
[null,null,null,null,null,null,null,null,null,null,null,null,null,null,null,null,null,null,null,null,null,"Copyright für das Logo \"Arbeitszeit klug gestalten\": RKW Hessen. Das Logo darf nur für den Checker in der Ursprungsform genutzt werden."]

{"sheet":"Dez","index":13,"n_rows":49,"n_cols":23,"rows_kept":49,"cut":false,"hidden":false,"merged":[[48,21,49,25],[45,22,46,25],[9,1,9,15],[47,1,47,2],[3,15,3,16],[6,1,8,1],[6,2,8,2],[6,3,8,3],[6,4,8,4],[6,5,8,5],[6,15,7,15],[7,9,7,10],[7,11,7,12],[47,22,47,25]]}
[null,"Arbeitszeit-Nachweis",null,null,null,null,null,"Name:",null,{"$f":"IF('meine Daten'!C3=\"\",\"\",'meine Daten'!C3)","v":""},null,null,null,null,null,null,null,null,{"$f":"B11","v":"2023-12-01"},{"$f":"B11","v":"2023-12-01"}]
[]
[null,null,null,null,"Symbol* :  ","U","=Urlaub"]
[null,null,null,null,null,"AU","=Krank/Kur",null,null,null,null,null,null,null,"bedeutet:","Eintrag fehlt "]
[null,null,null,null,null,"Z","Zeitausgleich (ganzer Tag)",null,null,null,null,null,null,null,"bedeutet:","mehr als 10 Stunden"]
[]
[null,"Datum","Tag","Sollzeit","Feiertag","Symbol *","Brutto-Arbeitszeit",null,null,"Pausen",null,null,null,null,"Netto","weitere\nReisezeit","Saldo"]
[null,null,null,null,null,null,null,null,null,"Mittag",null,"weitere\n(Std:Min)",null,"Summe","Arbeits-\nzeit",null,"Arbeits-\nzeit"]
[null,null,null,null,null,null,"von","bis","Std:Min","von","bis","I","II","./.Std:Min","Std:Min","Std:Min","Std:Min",null,null,"Bemerkung"]
[null,"Übertrag vom Vormonat: ",null,null,null,null,null,null,null,null,null,null,null,null,null,null,{"$f":"Nov!Q43","v":""}]
[null,{"$f":"Nov!B40+1","v":"2023-12-01"},{"$f":"TEXT(B11,\"TTT\")","v":"Fr"},{"$f":"IF(OR(E11=\"F\",F11=\"U\",F11=\"AU\"),'meine Daten'!$C$12,IF(C11=\"Mo\",'meine Daten'!$M$29,IF(C11=\"Di\",'meine Daten'!$M$30,IF(C11=\"Mi\",'meine Daten'!$M$31,IF(C11=\"Do\",'meine Daten'!$M$32,IF(C11=\"Fr\",'meine Daten'!$M$33,IF(C11=\"Sa\",'meine Daten'!$M$34,IF(C11=\"So\",'meine Daten'!$M$35))))))))","v":"08:00:00"},{"$f":"IF(R11=\"Feiertag\",\"F\",\"\")","v":""},null,null,null,{"$f":"H11-G11","v":"00:00:00"},null,null,null,null,{"$f":"K11-J11+L11+M11","v":"00:00:00"},{"$f":"I11-N11","v":"00:00:00"},null,{"$f":"IF(F11=\"Z\",-(D11),IF(G11=\"\",\" \",IF(O11+P11>D11,O11+P11-D11,IF(O11+P11<D11,-(D11-O11-P11),\" \"))))","v":" "},{"$f":"IF(ISERROR(VLOOKUP(B11,Feiertage!$B$5:$B$21,1,FALSE)),WEEKDAY(B11,2),\"Feiertag\")","v":5},{"$f":"IF(G11=\"\",0,(O11+P11-D11)*24)","v":0}]
[null,{"$f":"B11+1","v":"2023-12-02"},{"$f":"TEXT(B12,\"TTT\")","v":"Sa"},{"$f":"IF(OR(E12=\"F\",F12=\"U\",F12=\"AU\"),'meine Daten'!$C$12,IF(C12=\"Mo\",'meine Daten'!$M$29,IF(C12=\"Di\",'meine Daten'!$M$30,IF(C12=\"Mi\",'meine Daten'!$M$31,IF(C12=\"Do\",'meine Daten'!$M$32,IF(C12=\"Fr\",'meine Daten'!$M$33,IF(C12=\"Sa\",'meine Daten'!$M$34,IF(C12=\"So\",'meine Daten'!$M$35))))))))","v":"00:00:00"},"",null,null,null,{"$f":"H12-G12","v":"00:00:00"},null,null,null,null,{"$f":"K12-J12+L12+M12","v":"00:00:00"},"00:00:00",null,{"$f":"IF(F12=\"Z\",-(D12),IF(G12=\"\",\" \",IF(O12+P12>D12,O12+P12-D12,IF(O12+P12<D12,-(D12-O12-P12),\" \"))))","v":" "},{"$f":"IF(ISERROR(VLOOKUP(B12,Feiertage!$B$5:$B$21,1,FALSE)),WEEKDAY(B12,2),\"Feiertag\")","v":6},{"$f":"S11+IF(F12=\"Z\",-(#REF!*24),IF(G12=\"\",0,(O12+P12-D12)*24))","v":0}]
[null,{"$f":"B12+1","v":"2023-12-03"},"So",{"$f":"IF(OR(E13=\"F\",F13=\"U\",F13=\"AU\"),'meine Daten'!$C$12,IF(C13=\"Mo\",'meine Daten'!$M$29,IF(C13=\"Di\",'meine Daten'!$M$30,IF(C13=\"Mi\",'meine Daten'!$M$31,IF(C13=\"Do\",'meine Daten'!$M$32,IF(C13=\"Fr\",'meine Daten'!$M$33,IF(C13=\"Sa\",'meine Daten'!$M$34,IF(C13=\"So\",'meine Daten'!$M$35))))))))","v":"00:00:00"},"",null,null,null,{"$f":"H13-G13","v":"00:00:00"},null,null,null,null,"00:00:00","00:00:00",null," ",{"$f":"IF(ISERROR(VLOOKUP(B13,Feiertage!$B$5:$B$21,1,FALSE)),WEEKDAY(B13,2),\"Feiertag\")","v":7},{"$f":"S12+IF(F13=\"Z\",-(#REF!*24),IF(G13=\"\",0,(O13+P13-D13)*24))","v":0}]
[null,"2023-12-04","Mo",{"$f":"IF(OR(E14=\"F\",F14=\"U\",F14=\"AU\"),'meine Daten'!$C$12,IF(C14=\"Mo\",'meine Daten'!$M$29,IF(C14=\"Di\",'meine Daten'!$M$30,IF(C14=\"Mi\",'meine Daten'!$M$31,IF(C14=\"Do\",'meine Daten'!$M$32,IF(C14=\"Fr\",'meine Daten'!$M$33,IF(C14=\"Sa\",'meine Daten'!$M$34,IF(C14=\"So\",'meine Daten'!$M$35))))))))","v":"08:00:00"},"",null,null,null,"00:00:00",null,null,null,null,"00:00:00","00:00:00",null," ",{"$f":"IF(ISERROR(VLOOKUP(B14,Feiertage!$B$5:$B$21,1,FALSE)),WEEKDAY(B14,2),\"Feiertag\")","v":1},{"$f":"S13+IF(F14=\"Z\",-(#REF!*24),IF(G14=\"\",0,(O14+P14-D14)*24))","v":0}]
[null,"2023-12-05","Di",{"$f":"IF(OR(E15=\"F\",F15=\"U\",F15=\"AU\"),'meine Daten'!$C$12,IF(C15=\"Mo\",'meine Daten'!$M$29,IF(C15=\"Di\",'meine Daten'!$M$30,IF(C15=\"Mi\",'meine Daten'!$M$31,IF(C15=\"Do\",'meine Daten'!$M$32,IF(C15=\"Fr\",'meine Daten'!$M$33,IF(C15=\"Sa\",'meine Daten'!$M$34,IF(C15=\"So\",'meine Daten'!$M$35))))))))","v":"08:00:00"},"",null,null,null,"00:00:00",null,null,null,null,"00:00:00","00:00:00",null," ",{"$f":"IF(ISERROR(VLOOKUP(B15,Feiertage!$B$5:$B$21,1,FALSE)),WEEKDAY(B15,2),\"Feiertag\")","v":2},{"$f":"S14+IF(F15=\"Z\",-(#REF!*24),IF(G15=\"\",0,(O15+P15-D15)*24))","v":0}]
[null,"2023-12-06","Mi",{"$f":"IF(OR(E16=\"F\",F16=\"U\",F16=\"AU\"),'meine Daten'!$C$12,IF(C16=\"Mo\",'meine Daten'!$M$29,IF(C16=\"Di\",'meine Daten'!$M$30,IF(C16=\"Mi\",'meine Daten'!$M$31,IF(C16=\"Do\",'meine Daten'!$M$32,IF(C16=\"Fr\",'meine Daten'!$M$33,IF(C16=\"Sa\",'meine Daten'!$M$34,IF(C16=\"So\",'meine Daten'!$M$35))))))))","v":"08:00:00"},"",null,null,null,"00:00:00",null,null,null,null,"00:00:00","00:00:00",null," ",{"$f":"IF(ISERROR(VLOOKUP(B16,Feiertage!$B$5:$B$21,1,FALSE)),WEEKDAY(B16,2),\"Feiertag\")","v":3},{"$f":"S15+IF(F16=\"Z\",-(#REF!*24),IF(G16=\"\",0,(O16+P16-D16)*24))","v":0}]
[null,"2023-12-07","Do",{"$f":"IF(OR(E17=\"F\",F17=\"U\",F17=\"AU\"),'meine Daten'!$C$12,IF(C17=\"Mo\",'meine Daten'!$M$29,IF(C17=\"Di\",'meine Daten'!$M$30,IF(C17=\"Mi\",'meine Daten'!$M$31,IF(C17=\"Do\",'meine Daten'!$M$32,IF(C17=\"Fr\",'meine Daten'!$M$33,IF(C17=\"Sa\",'meine Daten'!$M$34,IF(C17=\"So\",'meine Daten'!$M$35))))))))","v":"08:00:00"},"",null,null,null,"00:00:00",null,null,null,null,"00:00:00","00:00:00",null," ",{"$f":"IF(ISERROR(VLOOKUP(B17,Feiertage!$B$5:$B$21,1,FALSE)),WEEKDAY(B17,2),\"Feiertag\")","v":4},{"$f":"S16+IF(F17=\"Z\",-(#REF!*24),IF(G17=\"\",0,(O17+P17-D17)*24))","v":0}]
[null,"2023-12-08","Fr",{"$f":"IF(OR(E18=\"F\",F18=\"U\",F18=\"AU\"),'meine Daten'!$C$12,IF(C18=\"Mo\",'meine Daten'!$M$29,IF(C18=\"Di\",'meine Daten'!$M$30,IF(C18=\"Mi\",'meine Daten'!$M$31,IF(C18=\"Do\",'meine Daten'!$M$32,IF(C18=\"Fr\",'meine Daten'!$M$33,IF(C18=\"Sa\",'meine Daten'!$M$34,IF(C18=\"So\",'meine Daten'!$M$35))))))))","v":"08:00:00"},"",null,null,null,"00:00:00",null,null,null,null,"00:00:00","00:00:00",null," ",{"$f":"IF(ISERROR(VLOOKUP(B18,Feiertage!$B$5:$B$21,1,FALSE)),WEEKDAY(B18,2),\"Feiertag\")","v":5},{"$f":"S17+IF(F18=\"Z\",-(#REF!*24),IF(G18=\"\",0,(O18+P18-D18)*24))","v":0}]
[null,"2023-12-09","Sa",{"$f":"IF(OR(E19=\"F\",F19=\"U\",F19=\"AU\"),'meine Daten'!$C$12,IF(C19=\"Mo\",'meine Daten'!$M$29,IF(C19=\"Di\",'meine Daten'!$M$30,IF(C19=\"Mi\",'meine Daten'!$M$31,IF(C19=\"Do\",'meine Daten'!$M$32,IF(C19=\"Fr\",'meine Daten'!$M$33,IF(C19=\"Sa\",'meine Daten'!$M$34,IF(C19=\"So\",'meine Daten'!$M$35))))))))","v":"00:00:00"},"",null,null,null,"00:00:00",null,null,null,null,"00:00:00","00:00:00",null," ",{"$f":"IF(ISERROR(VLOOKUP(B19,Feiertage!$B$5:$B$21,1,FALSE)),WEEKDAY(B19,2),\"Feiertag\")","v":6},{"$f":"S18+IF(F19=\"Z\",-(#REF!*24),IF(G19=\"\",0,(O19+P19-D19)*24))","v":0}]
[null,"2023-12-10","So",{"$f":"IF(OR(E20=\"F\",F20=\"U\",F20=\"AU\"),'meine Daten'!$C$12,IF(C20=\"Mo\",'meine Daten'!$M$29,IF(C20=\"Di\",'meine Daten'!$M$30,IF(C20=\"Mi\",'meine Daten'!$M$31,IF(C20=\"Do\",'meine Daten'!$M$32,IF(C20=\"Fr\",'meine Daten'!$M$33,IF(C20=\"Sa\",'meine Daten'!$M$34,IF(C20=\"So\",'meine Daten'!$M$35))))))))","v":"00:00:00"},"",null,null,null,"00:00:00",null,null,null,null,"00:00:00","00:00:00",null," ",{"$f":"IF(ISERROR(VLOOKUP(B20,Feiertage!$B$5:$B$21,1,FALSE)),WEEKDAY(B20,2),\"Feiertag\")","v":7},{"$f":"S19+IF(F20=\"Z\",-(#REF!*24),IF(G20=\"\",0,(O20+P20-D20)*24))","v":0}]
[null,"2023-12-11","Mo",{"$f":"IF(OR(E21=\"F\",F21=\"U\",F21=\"AU\"),'meine Daten'!$C$12,IF(C21=\"Mo\",'meine Daten'!$M$29,IF(C21=\"Di\",'meine Daten'!$M$30,IF(C21=\"Mi\",'meine Daten'!$M$31,IF(C21=\"Do\",'meine Daten'!$M$32,IF(C21=\"Fr\",'meine Daten'!$M$33,IF(C21=\"Sa\",'meine Daten'!$M$34,IF(C21=\"So\",'meine Daten'!$M$35))))))))","v":"08:00:00"},"",null,null,null,"00:00:00",null,null,null,null,"00:00:00","00:00:00",null," ",{"$f":"IF(ISERROR(VLOOKUP(B21,Feiertage!$B$5:$B$21,1,FALSE)),WEEKDAY(B21,2),\"Feiertag\")","v":1},{"$f":"S20+IF(F21=\"Z\",-(#REF!*24),IF(G21=\"\",0,(O21+P21-D21)*24))","v":0}]
[null,"2023-12-12","Di",{"$f":"IF(OR(E22=\"F\",F22=\"U\",F22=\"AU\"),'meine Daten'!$C$12,IF(C22=\"Mo\",'meine Daten'!$M$29,IF(C22=\"Di\",'meine Daten'!$M$30,IF(C22=\"Mi\",'meine Daten'!$M$31,IF(C22=\"Do\",'meine Daten'!$M$32,IF(C22=\"Fr\",'meine Daten'!$M$33,IF(C22=\"Sa\",'meine Daten'!$M$34,IF(C22=\"So\",'meine Daten'!$M$35))))))))","v":"08:00:00"},"",null,null,null,"00:00:00",null,null,null,null,"00:00:00","00:00:00",null," ",{"$f":"IF(ISERROR(VLOOKUP(B22,Feiertage!$B$5:$B$21,1,FALSE)),WEEKDAY(B22,2),\"Feiertag\")","v":2},{"$f":"S21+IF(F22=\"Z\",-(#REF!*24),IF(G22=\"\",0,(O22+P22-D22)*24))","v":0}]
[null,"2023-12-13","Mi",{"$f":"IF(OR(E23=\"F\",F23=\"U\",F23=\"AU\"),'meine Daten'!$C$12,IF(C23=\"Mo\",'meine Daten'!$M$29,IF(C23=\"Di\",'meine Daten'!$M$30,IF(C23=\"Mi\",'meine Daten'!$M$31,IF(C23=\"Do\",'meine Daten'!$M$32,IF(C23=\"Fr\",'meine Daten'!$M$33,IF(C23=\"Sa\",'meine Daten'!$M$34,IF(C23=\"So\",'meine Daten'!$M$35))))))))","v":"08:00:00"},"",null,null,null,"00:00:00",null,null,null,null,"00:00:00","00:00:00",null," ",{"$f":"IF(ISERROR(VLOOKUP(B23,Feiertage!$B$5:$B$21,1,FALSE)),WEEKDAY(B23,2),\"Feiertag\")","v":3},{"$f":"S22+IF(F23=\"Z\",-(#REF!*24),IF(G23=\"\",0,(O23+P23-D23)*24))","v":0}]
[null,"2023-12-14","Do",{"$f":"IF(OR(E24=\"F\",F24=\"U\",F24=\"AU\"),'meine Daten'!$C$12,IF(C24=\"Mo\",'meine Daten'!$M$29,IF(C24=\"Di\",'meine Daten'!$M$30,IF(C24=\"Mi\",'meine Daten'!$M$31,IF(C24=\"Do\",'meine Daten'!$M$32,IF(C24=\"Fr\",'meine Daten'!$M$33,IF(C24=\"Sa\",'meine Daten'!$M$34,IF(C24=\"So\",'meine Daten'!$M$35))))))))","v":"08:00:00"},"",null,null,null,"00:00:00",null,null,null,null,"00:00:00","00:00:00",null," ",{"$f":"IF(ISERROR(VLOOKUP(B24,Feiertage!$B$5:$B$21,1,FALSE)),WEEKDAY(B24,2),\"Feiertag\")","v":4},{"$f":"S23+IF(F24=\"Z\",-(#REF!*24),IF(G24=\"\",0,(O24+P24-D24)*24))","v":0}]
[null,"2023-12-15","Fr",{"$f":"IF(OR(E25=\"F\",F25=\"U\",F25=\"AU\"),'meine Daten'!$C$12,IF(C25=\"Mo\",'meine Daten'!$M$29,IF(C25=\"Di\",'meine Daten'!$M$30,IF(C25=\"Mi\",'meine Daten'!$M$31,IF(C25=\"Do\",'meine Daten'!$M$32,IF(C25=\"Fr\",'meine Daten'!$M$33,IF(C25=\"Sa\",'meine Daten'!$M$34,IF(C25=\"So\",'meine Daten'!$M$35))))))))","v":"08:00:00"},"",null,null,null,"00:00:00",null,null,null,null,"00:00:00","00:00:00",null," ",{"$f":"IF(ISERROR(VLOOKUP(B25,Feiertage!$B$5:$B$21,1,FALSE)),WEEKDAY(B25,2),\"Feiertag\")","v":5},{"$f":"S24+IF(F25=\"Z\",-(#REF!*24),IF(G25=\"\",0,(O25+P25-D25)*24))","v":0}]
[null,"2023-12-16","Sa",{"$f":"IF(OR(E26=\"F\",F26=\"U\",F26=\"AU\"),'meine Daten'!$C$12,IF(C26=\"Mo\",'meine Daten'!$M$29,IF(C26=\"Di\",'meine Daten'!$M$30,IF(C26=\"Mi\",'meine Daten'!$M$31,IF(C26=\"Do\",'meine Daten'!$M$32,IF(C26=\"Fr\",'meine Daten'!$M$33,IF(C26=\"Sa\",'meine Daten'!$M$34,IF(C26=\"So\",'meine Daten'!$M$35))))))))","v":"00:00:00"},"",null,null,null,"00:00:00",null,null,null,null,"00:00:00","00:00:00",null," ",{"$f":"IF(ISERROR(VLOOKUP(B26,Feiertage!$B$5:$B$21,1,FALSE)),WEEKDAY(B26,2),\"Feiertag\")","v":6},{"$f":"S25+IF(F26=\"Z\",-(#REF!*24),IF(G26=\"\",0,(O26+P26-D26)*24))","v":0}]
[null,"2023-12-17","So",{"$f":"IF(OR(E27=\"F\",F27=\"U\",F27=\"AU\"),'meine Daten'!$C$12,IF(C27=\"Mo\",'meine Daten'!$M$29,IF(C27=\"Di\",'meine Daten'!$M$30,IF(C27=\"Mi\",'meine Daten'!$M$31,IF(C27=\"Do\",'meine Daten'!$M$32,IF(C27=\"Fr\",'meine Daten'!$M$33,IF(C27=\"Sa\",'meine Daten'!$M$34,IF(C27=\"So\",'meine Daten'!$M$35))))))))","v":"00:00:00"},"",null,null,null,"00:00:00",null,null,null,null,"00:00:00","00:00:00",null," ",{"$f":"IF(ISERROR(VLOOKUP(B27,Feiertage!$B$5:$B$21,1,FALSE)),WEEKDAY(B27,2),\"Feiertag\")","v":7},{"$f":"S26+IF(F27=\"Z\",-(#REF!*24),IF(G27=\"\",0,(O27+P27-D27)*24))","v":0}]
[null,"2023-12-18","Mo",{"$f":"IF(OR(E28=\"F\",F28=\"U\",F28=\"AU\"),'meine Daten'!$C$12,IF(C28=\"Mo\",'meine Daten'!$M$29,IF(C28=\"Di\",'meine Daten'!$M$30,IF(C28=\"Mi\",'meine Daten'!$M$31,IF(C28=\"Do\",'meine Daten'!$M$32,IF(C28=\"Fr\",'meine Daten'!$M$33,IF(C28=\"Sa\",'meine Daten'!$M$34,IF(C28=\"So\",'meine Daten'!$M$35))))))))","v":"08:00:00"},"",null,null,null,"00:00:00",null,null,null,null,"00:00:00","00:00:00",null," ",{"$f":"IF(ISERROR(VLOOKUP(B28,Feiertage!$B$5:$B$21,1,FALSE)),WEEKDAY(B28,2),\"Feiertag\")","v":1},{"$f":"S27+IF(F28=\"Z\",-(#REF!*24),IF(G28=\"\",0,(O28+P28-D28)*24))","v":0}]
[null,"2023-12-19","Di",{"$f":"IF(OR(E29=\"F\",F29=\"U\",F29=\"AU\"),'meine Daten'!$C$12,IF(C29=\"Mo\",'meine Daten'!$M$29,IF(C29=\"Di\",'meine Daten'!$M$30,IF(C29=\"Mi\",'meine Daten'!$M$31,IF(C29=\"Do\",'meine Daten'!$M$32,IF(C29=\"Fr\",'meine Daten'!$M$33,IF(C29=\"Sa\",'meine Daten'!$M$34,IF(C29=\"So\",'meine Daten'!$M$35))))))))","v":"08:00:00"},"",null,null,null,"00:00:00",null,null,null,null,"00:00:00","00:00:00",null," ",{"$f":"IF(ISERROR(VLOOKUP(B29,Feiertage!$B$5:$B$21,1,FALSE)),WEEKDAY(B29,2),\"Feiertag\")","v":2},{"$f":"S28+IF(F29=\"Z\",-(#REF!*24),IF(G29=\"\",0,(O29+P29-D29)*24))","v":0}]
[null,"2023-12-20","Mi",{"$f":"IF(OR(E30=\"F\",F30=\"U\",F30=\"AU\"),'meine Daten'!$C$12,IF(C30=\"Mo\",'meine Daten'!$M$29,IF(C30=\"Di\",'meine Daten'!$M$30,IF(C30=\"Mi\",'meine Daten'!$M$31,IF(C30=\"Do\",'meine Daten'!$M$32,IF(C30=\"Fr\",'meine Daten'!$M$33,IF(C30=\"Sa\",'meine Daten'!$M$34,IF(C30=\"So\",'meine Daten'!$M$35))))))))","v":"08:00:00"},"",null,null,null,"00:00:00",null,null,null,null,"00:00:00","00:00:00",null," ",{"$f":"IF(ISERROR(VLOOKUP(B30,Feiertage!$B$5:$B$21,1,FALSE)),WEEKDAY(B30,2),\"Feiertag\")","v":3},{"$f":"S29+IF(F30=\"Z\",-(#REF!*24),IF(G30=\"\",0,(O30+P30-D30)*24))","v":0}]
[null,"2023-12-21","Do",{"$f":"IF(OR(E31=\"F\",F31=\"U\",F31=\"AU\"),'meine Daten'!$C$12,IF(C31=\"Mo\",'meine Daten'!$M$29,IF(C31=\"Di\",'meine Daten'!$M$30,IF(C31=\"Mi\",'meine Daten'!$M$31,IF(C31=\"Do\",'meine Daten'!$M$32,IF(C31=\"Fr\",'meine Daten'!$M$33,IF(C31=\"Sa\",'meine Daten'!$M$34,IF(C31=\"So\",'meine Daten'!$M$35))))))))","v":"08:00:00"},"",null,null,null,"00:00:00",null,null,null,null,"00:00:00","00:00:00",null," ",{"$f":"IF(ISERROR(VLOOKUP(B31,Feiertage!$B$5:$B$21,1,FALSE)),WEEKDAY(B31,2),\"Feiertag\")","v":4},{"$f":"S30+IF(F31=\"Z\",-(#REF!*24),IF(G31=\"\",0,(O31+P31-D31)*24))","v":0}]
[null,"2023-12-22","Fr",{"$f":"IF(OR(E32=\"F\",F32=\"U\",F32=\"AU\"),'meine Daten'!$C$12,IF(C32=\"Mo\",'meine Daten'!$M$29,IF(C32=\"Di\",'meine Daten'!$M$30,IF(C32=\"Mi\",'meine Daten'!$M$31,IF(C32=\"Do\",'meine Daten'!$M$32,IF(C32=\"Fr\",'meine Daten'!$M$33,IF(C32=\"Sa\",'meine Daten'!$M$34,IF(C32=\"So\",'meine Daten'!$M$35))))))))","v":"08:00:00"},"",null,null,null,"00:00:00",null,null,null,null,"00:00:00","00:00:00",null," ",{"$f":"IF(ISERROR(VLOOKUP(B32,Feiertage!$B$5:$B$21,1,FALSE)),WEEKDAY(B32,2),\"Feiertag\")","v":5},{"$f":"S31+IF(F32=\"Z\",-(#REF!*24),IF(G32=\"\",0,(O32+P32-D32)*24))","v":0}]
[null,"2023-12-23","Sa",{"$f":"IF(OR(E33=\"F\",F33=\"U\",F33=\"AU\"),'meine Daten'!$C$12,IF(C33=\"Mo\",'meine Daten'!$M$29,IF(C33=\"Di\",'meine Daten'!$M$30,IF(C33=\"Mi\",'meine Daten'!$M$31,IF(C33=\"Do\",'meine Daten'!$M$32,IF(C33=\"Fr\",'meine Daten'!$M$33,IF(C33=\"Sa\",'meine Daten'!$M$34,IF(C33=\"So\",'meine Daten'!$M$35))))))))","v":"00:00:00"},"",null,null,null,"00:00:00",null,null,null,null,"00:00:00","00:00:00",null," ",{"$f":"IF(ISERROR(VLOOKUP(B33,Feiertage!$B$5:$B$21,1,FALSE)),WEEKDAY(B33,2),\"Feiertag\")","v":6},{"$f":"S32+IF(F33=\"Z\",-(#REF!*24),IF(G33=\"\",0,(O33+P33-D33)*24))","v":0}]
[null,"2023-12-24","So",{"$f":"IF(OR(E34=\"F\",F34=\"U\",F34=\"AU\"),'meine Daten'!$C$12,IF(C34=\"Mo\",'meine Daten'!$M$29,IF(C34=\"Di\",'meine Daten'!$M$30,IF(C34=\"Mi\",'meine Daten'!$M$31,IF(C34=\"Do\",'meine Daten'!$M$32,IF(C34=\"Fr\",'meine Daten'!$M$33,IF(C34=\"Sa\",'meine Daten'!$M$34,IF(C34=\"So\",'meine Daten'!$M$35))))))))","v":"00:00:00"},"F",null,null,null,"00:00:00",null,null,null,null,"00:00:00","00:00:00",null," ",{"$f":"IF(ISERROR(VLOOKUP(B34,Feiertage!$B$5:$B$21,1,FALSE)),WEEKDAY(B34,2),\"Feiertag\")","v":"Feiertag"},{"$f":"S33+IF(F34=\"Z\",-(#REF!*24),IF(G34=\"\",0,(O34+P34-D34)*24))","v":0}]
[null,"2023-12-25","Mo",{"$f":"IF(OR(E35=\"F\",F35=\"U\",F35=\"AU\"),'meine Daten'!$C$12,IF(C35=\"Mo\",'meine Daten'!$M$29,IF(C35=\"Di\",'meine Daten'!$M$30,IF(C35=\"Mi\",'meine Daten'!$M$31,IF(C35=\"Do\",'meine Daten'!$M$32,IF(C35=\"Fr\",'meine Daten'!$M$33,IF(C35=\"Sa\",'meine Daten'!$M$34,IF(C35=\"So\",'meine Daten'!$M$35))))))))","v":"00:00:00"},"F",null,null,null,"00:00:00",null,null,null,null,"00:00:00","00:00:00",null," ",{"$f":"IF(ISERROR(VLOOKUP(B35,Feiertage!$B$5:$B$21,1,FALSE)),WEEKDAY(B35,2),\"Feiertag\")","v":"Feiertag"},{"$f":"S34+IF(F35=\"Z\",-(#REF!*24),IF(G35=\"\",0,(O35+P35-D35)*24))","v":0}]
[null,"2023-12-26","Di",{"$f":"IF(OR(E36=\"F\",F36=\"U\",F36=\"AU\"),'meine Daten'!$C$12,IF(C36=\"Mo\",'meine Daten'!$M$29,IF(C36=\"Di\",'meine Daten'!$M$30,IF(C36=\"Mi\",'meine Daten'!$M$31,IF(C36=\"Do\",'meine Daten'!$M$32,IF(C36=\"Fr\",'meine Daten'!$M$33,IF(C36=\"Sa\",'meine Daten'!$M$34,IF(C36=\"So\",'meine Daten'!$M$35))))))))","v":"00:00:00"},"F",null,null,null,"00:00:00",null,null,null,null,"00:00:00","00:00:00",null," ",{"$f":"IF(ISERROR(VLOOKUP(B36,Feiertage!$B$5:$B$21,1,FALSE)),WEEKDAY(B36,2),\"Feiertag\")","v":"Feiertag"},{"$f":"S35+IF(F36=\"Z\",-(#REF!*24),IF(G36=\"\",0,(O36+P36-D36)*24))","v":0}]
[null,"2023-12-27","Mi",{"$f":"IF(OR(E37=\"F\",F37=\"U\",F37=\"AU\"),'meine Daten'!$C$12,IF(C37=\"Mo\",'meine Daten'!$M$29,IF(C37=\"Di\",'meine Daten'!$M$30,IF(C37=\"Mi\",'meine Daten'!$M$31,IF(C37=\"Do\",'meine Daten'!$M$32,IF(C37=\"Fr\",'meine Daten'!$M$33,IF(C37=\"Sa\",'meine Daten'!$M$34,IF(C37=\"So\",'meine Daten'!$M$35))))))))","v":"08:00:00"},"",null,null,null,"00:00:00",null,null,null,null,"00:00:00","00:00:00",null," ",{"$f":"IF(ISERROR(VLOOKUP(B37,Feiertage!$B$5:$B$21,1,FALSE)),WEEKDAY(B37,2),\"Feiertag\")","v":3},{"$f":"S36+IF(F37=\"Z\",-(#REF!*24),IF(G37=\"\",0,(O37+P37-D37)*24))","v":0}]
[null,"2023-12-28","Do",{"$f":"IF(OR(E38=\"F\",F38=\"U\",F38=\"AU\"),'meine Daten'!$C$12,IF(C38=\"Mo\",'meine Daten'!$M$29,IF(C38=\"Di\",'meine Daten'!$M$30,IF(C38=\"Mi\",'meine Daten'!$M$31,IF(C38=\"Do\",'meine Daten'!$M$32,IF(C38=\"Fr\",'meine Daten'!$M$33,IF(C38=\"Sa\",'meine Daten'!$M$34,IF(C38=\"So\",'meine Daten'!$M$35))))))))","v":"08:00:00"},"",null,null,null,"00:00:00",null,null,null,null,"00:00:00","00:00:00",null," ",{"$f":"IF(ISERROR(VLOOKUP(B38,Feiertage!$B$5:$B$21,1,FALSE)),WEEKDAY(B38,2),\"Feiertag\")","v":4},{"$f":"S37+IF(F38=\"Z\",-(#REF!*24),IF(G38=\"\",0,(O38+P38-D38)*24))","v":0},null,null,"Ich versichere die Richtigkeit meiner Angaben. Mir ist bekannt, "]
[null,"2023-12-29","Fr",{"$f":"IF(OR(E39=\"F\",F39=\"U\",F39=\"AU\"),'meine Daten'!$C$12,IF(C39=\"Mo\",'meine Daten'!$M$29,IF(C39=\"Di\",'meine Daten'!$M$30,IF(C39=\"Mi\",'meine Daten'!$M$31,IF(C39=\"Do\",'meine Daten'!$M$32,IF(C39=\"Fr\",'meine Daten'!$M$33,IF(C39=\"Sa\",'meine Daten'!$M$34,IF(C39=\"So\",'meine Daten'!$M$35))))))))","v":"08:00:00"},"",null,null,null,"00:00:00",null,null,null,null,"00:00:00","00:00:00",null," ",{"$f":"IF(ISERROR(VLOOKUP(B39,Feiertage!$B$5:$B$21,1,FALSE)),WEEKDAY(B39,2),\"Feiertag\")","v":5},{"$f":"S38+IF(F39=\"Z\",-(#REF!*24),IF(G39=\"\",0,(O39+P39-D39)*24))","v":0},null,null,"dass unrichtige Angaben eine grobe Pflichtverletzung darstellen. "]
[null,"2023-12-30","Sa",{"$f":"IF(OR(E40=\"F\",F40=\"U\",F40=\"AU\"),'meine Daten'!$C$12,IF(C40=\"Mo\",'meine Daten'!$M$29,IF(C40=\"Di\",'meine Daten'!$M$30,IF(C40=\"Mi\",'meine Daten'!$M$31,IF(C40=\"Do\",'meine Daten'!$M$32,IF(C40=\"Fr\",'meine Daten'!$M$33,IF(C40=\"Sa\",'meine Daten'!$M$34,IF(C40=\"So\",'meine Daten'!$M$35))))))))","v":"00:00:00"},"",null,null,null,"00:00:00",null,null,null,null,"00:00:00","00:00:00",null," ",{"$f":"IF(ISERROR(VLOOKUP(B40,Feiertage!$B$5:$B$21,1,FALSE)),WEEKDAY(B40,2),\"Feiertag\")","v":6},{"$f":"S39+IF(F40=\"Z\",-(#REF!*24),IF(G40=\"\",0,(O40+P40-D40)*24))","v":0}]
[null,"2023-12-31","So",{"$f":"IF(OR(E41=\"F\",F41=\"U\",F41=\"AU\"),'meine Daten'!$C$12,IF(C41=\"Mo\",'meine Daten'!$M$29,IF(C41=\"Di\",'meine Daten'!$M$30,IF(C41=\"Mi\",'meine Daten'!$M$31,IF(C41=\"Do\",'meine Daten'!$M$32,IF(C41=\"Fr\",'meine Daten'!$M$33,IF(C41=\"Sa\",'meine Daten'!$M$34,IF(C41=\"So\",'meine Daten'!$M$35))))))))","v":"00:00:00"},"F",null,null,null,"00:00:00",null,null,null,null,"00:00:00","00:00:00",null," ",{"$f":"IF(ISERROR(VLOOKUP(B41,Feiertage!$B$5:$B$21,1,FALSE)),WEEKDAY(B41,2),\"Feiertag\")","v":"Feiertag"},{"$f":"S40+IF(F41=\"Z\",-(#REF!*24),IF(G41=\"\",0,(O41+P41-D41)*24))","v":0}]
[null,null,null,null,null,{"$f":"COUNTIF(F13:F41,\"U\")+COUNTIF(F13:F41,\"Z\")+COUNTIF(F13:F41,AU)","v":0},{"$f":"IF(SUM(G13:G41)<=0,0,1)","v":0},null,null,null,null,null,null,null,null,null,{"$f":"SUM(Q11:Q41)","v":0}]
[null,null,null,null,null,null,null,null,null,null,null,null,null,"Monatssaldo:",null,null,{"$f":"IF(F42+G42=0,\"\",SUM(Q11:Q41))","v":""}]
[null,null,null,null,null,null,null,null,null,null,null,null,null,"Gleitzeitkontostand:",null,null,{"$f":"IF(OR(Q10=\"\",Q43=\"\"),\"\",Q10+Q43)","v":""},null,null,null,null,"Datum, Unterschrift"]
[null,null,null,null,null,null,null,null,null,null,null,null,null,"(In Stunden:Minuten)"]
[null,null,null,null,null,null,null,null,null,null,null,null,null,null,null,null,null,null,null,null,null,null,"„Der Arbeitszeit-Checker“ von Simone Back für www.arbeitszeit-klug-gestalten.de "]
[null,null,null,null,null,null,null,null,null,null,null,null,null,"Urlaubstage",null,null,{"$f":"COUNTIF(F11:F41,\"U\")","v":0}]
[null,null,null,null,null,null,null,null,null,null,null,null,null,null,null,null,null,null,null,null,null,null,"ist lizensiert unter einer Creative Commons Lizenz CC BY SA 4.0 \n(Nutzung bei Namensnennung, Weitergabe unter gleichen Bedingungen)"]
[null,null,null,null,null,null,null,null,null,null,null,null,null,null,null,null,null,null,null,null,null,"Copyright für das Logo \"Arbeitszeit klug gestalten\": RKW Hessen. Das Logo darf nur für den Checker in der Ursprungsform genutzt werden."]

{"sheet":"Gleitzeitsaldo","index":14,"n_rows":29,"n_cols":7,"rows_kept":29,"cut":false,"hidden":false,"merged":[[28,1,29,6],[26,2,27,6],[0,1,0,3],[5,6,6,6],[20,6,21,6],[2,2,2,5],[5,1,5,2],[5,4,6,5],[20,4,21,4],[20,5,21,5]]}
[null,"Urlaubs  und Gleitzeitsaldo",null,null,{"$f":"Jan!B11","v":"2023-01-01"}]
[]
[null,"Name: ",{"$f":"IF('meine Daten'!C3=\"\",\"\",'meine Daten'!C3)","v":""}]
[]
[]
[null,"Urlaub",null,null,"Gleitzeitsaldo",null,"Monatssaldo"]
[null,"Urlaubstage/Jahr:",{"$f":"'meine Daten'!L42","v":0}]
[null,"Übertrag Vorjahr:",{"$f":"'meine Daten'!L41","v":0},null,"Übertrag Vorjahr",{"$f":"Jan!Q10","v":0}]
[null,"Januar",{"$f":"Jan!Q47","v":0},null,"Januar",{"$f":"IF(Jan!F42+Jan!G42=0,\"\",Jan!Q44)","v":""},{"$f":"Jan!Q43","v":""}]
[null,"Februar",{"$f":"Feb!Q45","v":0},null,"Februar",{"$f":"IF(Feb!F40+Feb!G40=0,\"\",Feb!Q42)","v":""},{"$f":"Feb!Q41","v":""}]
[null,"März",{"$f":"März!Q47","v":0},null,"März",{"$f":"IF(März!F42+März!G42=0,\"\",März!Q44)","v":""},{"$f":"März!Q43","v":""}]
[null,"April",{"$f":"April!Q46","v":0},null,"April",{"$f":"IF(April!F41+April!G41=0,\"\",April!Q43)","v":""},{"$f":"April!Q42","v":""}]
[null,"Mai",{"$f":"Mai!Q47","v":0},null,"Mai",{"$f":"IF(Mai!F42:G42=0,\"\",Mai!Q44)","v":""},{"$f":"Mai!Q43","v":""}]
[null,"Juni",{"$f":"Juni!Q46","v":0},null,"Juni",{"$f":"IF(Juni!F41:G41=0,\"\",Juni!Q43)","v":""},{"$f":"Juni!Q42","v":""}]
[null,"Juli",{"$f":"Juli!Q47","v":0},null,"Juli",{"$f":"IF(Juli!F42:G42=0,\"\",Juli!Q44)","v":""},{"$f":"Juli!Q43","v":""}]
[null,"August",{"$f":"Aug!Q47","v":0},null,"August",{"$f":"Aug!Q44","v":""},{"$f":"Aug!Q43","v":""}]
[null,"September",{"$f":"Sept!Q46","v":0},null,"September",{"$f":"IF(Sept!F41:G41=0,\"\",Sept!Q43)","v":""},{"$f":"Sept!Q42","v":""}]
[null,"Oktober",{"$f":"Okt!Q47","v":0},null,"Oktober",{"$f":"IF(Okt!F42:G42=0,\"\",Okt!Q44)","v":""},{"$f":"Okt!Q43","v":""}]
[null,"November",{"$f":"Nov!Q46","v":0},null,"November",{"$f":"IF(Nov!F41:G41=0,\"\",Nov!Q43)","v":""},{"$f":"Nov!Q42","v":""}]
[null,"Dezember",{"$f":"Dez!Q47","v":0},null,"Dezember",{"$f":"IF(Dez!F42:G42=0,\"\",Dez!Q44)","v":""},{"$f":"Dez!Q43","v":""}]
[null,"Genommener Urlaub",{"$f":"SUM(C9:C20)","v":0},null,"Übertrag \nFolgejahr:",{"$f":"F20","v":""}]
[null,"Resturlaub",{"$f":"C7+C8-C21","v":0}]
[]
[null,null,null,null,null,"(Format: [hh]:mm)"]
[]
[null,null,"„Der Arbeitszeit-Checker“ von Simone Back für www.arbeitszeit-klug-gestalten.de"]
[null,null,"ist lizensiert unter einer Creative Commons Lizenz CC BY SA 4.0\n(Nutzung bei Namensnennung, Weitergabe unter gleichen Bedingungen)"]
[]
[null,"Copyright für das Logo \"Arbeitszeit klug gestalten\": RKW Hessen. Das Logo darf nur für den Checker in der Ursprungsform genutzt werden."]

{"sheet":"meine Daten","index":15,"n_rows":47,"n_cols":15,"rows_kept":47,"cut":false,"hidden":false,"merged":[[45,3,45,9],[46,2,47,9],[41,1,41,9],[0,1,0,14],[1,1,1,14],[2,2,2,7],[37,1,38,9],[40,1,40,9]]}
[null,"Tragen Sie bitte Namen, die reguläre tägliche Arbeitsdauer (ohne Pause), den Gleitzeitsaldo \nund Urlaubsanspruch für das laufende Jahr ein (Format: StundenMinuten OHNE Doppelpunkt)."]
[null,"Die Zeiten werden automatisch mit den Werte des Vortages bzw. Vormonats gefüllt, können aber bei Bedarf überschrieben werden. Bei Bedarf können Samstag und Sonntag als Regelarbeitstag ausgeblendet werden (indem auf das  Minus/Plus in der grauen Ansichtsleiste ganz links geklickt wird."]
[null,"Name:"]
[]
[null,"Mo","08:00:00",null,"Januar",null,"Mo",{"$f":"C29","v":"08:00:00"},null,"Mai",null,"Mo",{"$f":"H29","v":"08:00:00"},null,"September"]
[null,"Di","08:00:00",null,null,null,"Di",{"$f":"C30","v":"08:00:00"},null,null,null,"Di","08:00:00"]
[null,"Mi","08:00:00",null,null,null,"Mi",{"$f":"C31","v":"08:00:00"},null,null,null,"Mi","08:00:00"]
[null,"Do","08:00:00",null,null,null,"Do","08:00:00",null,null,null,"Do","08:00:00"]
[null,"Fr","08:00:00",null,null,null,"Fr","08:00:00",null,null,null,"Fr","08:00:00"]
[null,"Sa","00:00:00",null,null,null,"Sa","00:00:00",null,null,null,"Sa","00:00:00"]
[null,"So","00:00:00",null,null,null,"So","00:00:00",null,null,null,"So","00:00:00"]
[]
[null,"Mo",{"$f":"C5","v":"08:00:00"},null,"Februar",null,"Mo",{"$f":"H5","v":"08:00:00"},null,"Juni",null,"Mo",{"$f":"M5","v":"08:00:00"},null,"Oktober"]
[null,"Di","08:00:00",null,null,null,"Di","08:00:00",null,null,null,"Di",{"$f":"M6","v":"08:00:00"}]
[null,"Mi","08:00:00",null,null,null,"Mi","08:00:00",null,null,null,"Mi","08:00:00"]
[null,"Do","08:00:00",null,null,null,"Do","08:00:00",null,null,null,"Do","08:00:00"]
[null,"Fr","08:00:00",null,null,null,"Fr","08:00:00",null,null,null,"Fr","08:00:00"]
[null,"Sa","00:00:00",null,null,null,"Sa","00:00:00",null,null,null,"Sa","00:00:00"]
[null,"So","00:00:00",null,null,null,"So","00:00:00",null,null,null,"So","00:00:00"]
[]
[null,"Mo",{"$f":"C13","v":"08:00:00"},null,"März",null,"Mo",{"$f":"H13","v":"08:00:00"},null,"Juli",null,"Mo",{"$f":"M13","v":"08:00:00"},null,"November"]
[null,"Di","08:00:00",null,null,null,"Di","08:00:00",null,null,null,"Di","08:00:00"]
[null,"Mi","08:00:00",null,null,null,"Mi","08:00:00",null,null,null,"Mi","08:00:00"]
[null,"Do","08:00:00",null,null,null,"Do","08:00:00",null,null,null,"Do","08:00:00"]
[null,"Fr","08:00:00",null,null,null,"Fr","08:00:00",null,null,null,"Fr","08:00:00"]
[null,"Sa","00:00:00",null,null,null,"Sa","00:00:00",null,null,null,"Sa","00:00:00"]
[null,"So","00:00:00",null,null,null,"So","00:00:00",null,null,null,"So","00:00:00"]
[]
[null,"Mo",{"$f":"C21","v":"08:00:00"},null,"April",null,"Mo",{"$f":"H21","v":"08:00:00"},null,"August",null,"Mo",{"$f":"M21","v":"08:00:00"},null,"Dezember"]
[null,"Di",{"$f":"C22","v":"08:00:00"},null,null,null,"Di",{"$f":"H22","v":"08:00:00"},null,null,null,"Di","08:00:00"]
[null,"Mi",{"$f":"C23","v":"08:00:00"},null,null,null,"Mi","08:00:00",null,null,null,"Mi","08:00:00"]
[null,"Do",{"$f":"C24","v":"08:00:00"},null,null,null,"Do","08:00:00",null,null,null,"Do","08:00:00"]
[null,"Fr",{"$f":"C25","v":"08:00:00"},null,null,null,"Fr","08:00:00",null,null,null,"Fr","08:00:00"]
[null,"Sa","00:00:00",null,null,null,"Sa","00:00:00",null,null,null,"Sa","00:00:00"]
[null,"So","00:00:00",null,null,null,"So","00:00:00",null,null,null,"So","00:00:00"]
[]
[]
[null,"Gleitzeitsaldo vom Vorjahr\nje nach Saldo rechts oder links eintragen (Format: StundenMinuten OHNE Doppelpunkt)",null,null,null,null,null,null,null,null,null,"Plus","Minus"]
[]
[]
[null,"Resturlaub vom Vorjahr (in Tagen)"]
[null,"Urlaubsanspruch laufendes Jahr (in Tagen)"]
[]
[]
[null,null,null,"„Der Arbeitszeit-Checker“ von Simone Back für www.arbeitszeit-klug-gestalten.de"]
[null,null,null,"ist lizensiert unter einer Creative Commons Lizenz CC BY SA 4.0\n(Nutzung bei Namensnennung, Weitergabe unter gleichen Bedingungen)"]
[null,null,"Copyright für das Logo \"Arbeitszeit klug gestalten\": RKW Hessen. Das Logo darf nur für den Checker in der Ursprungsform genutzt werden."]

{"sheet":"Feiertage","index":16,"n_rows":21,"n_cols":10,"rows_kept":21,"cut":false,"hidden":false,"merged":[[2,0,2,4],[4,9,5,13],[6,9,7,13],[3,9,3,13]]}
["Bitte tragen Sie hier nur die für Sie geltenden arbeitsfreien Feiertage ein."]
[]
["Wichtig: Nutzen Sie das Format Tag Monat Jahr.\nDie Jahreszahl oben generiert automatisch die Daten für Neujahr, Karfreitag, Ostermontag, Maifeiertag, Himmelfahrt, Pfingsten,Fronleichnam, Tag der Deutschen Einheit\nsowie Weihnachtsfeiertage und Silvester , diese Tage können\naber einzeln gelöscht werden, wenn dies kein arbeitsfreier Tag ist."]
[null,"Feiertagstabelle",null,2023,null,null,null,null,null,"„Der Arbeitszeit-Checker“ von Simone Back für www.arbeitszeit-klug-gestalten.de"]
[null,{"$f":"DATE(Jahr,1,1)","v":"2023-01-01"},"Neujahr",null,null,null,null,null,null,"ist lizensiert unter einer Creative Commons Lizenz CC BY SA 4.0\n(Nutzung bei Namensnennung, Weitergabe unter gleichen Bedingungen)\n"]
[null,null,"Dreikönig"]
[null,null,"Rosenmontag",null,null,null,null,null,null,"Copyright für das Logo \"Arbeitszeit klug gestalten\": RKW Hessen. Das Logo darf nur für den Checker in der Ursprungsform genutzt werden."]
[null,{"$f":"Ostern-2","v":"2023-04-07"},"Karfreitag"]
[null,{"$f":"Ostern+1","v":"2023-04-10"},"Ostermontag","Ostersonntag"]
[null,{"$f":"DATE(Jahr,5,1)","v":"2023-05-01"},"Maifeiertag",{"$f":"DATE(Jahr,3,28)+MOD(24-MOD(Jahr,19)*10.63,29)-MOD(TRUNC(Jahr*5/4)+MOD(24-MOD(Jahr,19)*10.63,29)+1,7)","v":"2023-04-09"}]
[null,{"$f":"Ostern+39","v":"2023-05-18"},"Christi Himmelfahrt"]
[null,{"$f":"B11+11","v":"2023-05-29"},"Pfingstmontag"]
[null,{"$f":"B12+10","v":"2023-06-08"},"Fronleichnam"]
[null,null,"Mariä Himmelfahrt"]
[null,{"$f":"DATE(Jahr,10,3)","v":"2023-10-03"},"Tag der Deutschen Einheit"]
[null,null,"Allerheiligen"]
[null,null,"ggf. weiterer Feiertag"]
[null,{"$f":"DATE(Jahr,12,24)","v":"2023-12-24"},"Heiligabend"]
[null,{"$f":"DATE(Jahr,12,25)","v":"2023-12-25"},"1. Weihnachtstag"]
[null,{"$f":"DATE(Jahr,12,26)","v":"2023-12-26"},"2. Weihnachtstag"]
[null,{"$f":"DATE(Jahr,12,31)","v":"2023-12-31"},"Silvester"]